program: Gaussian 09
title: 000209327
version: EM64L-G09RevD.01
frameworkgroup: C1[X(C11H12ClN3)]
method: RPBEPBE
basis: SDD
operation: Freq
keyword: #p
keyword: freq=noraman
keyword: PBEPBE/SDD
title: #p freq=noraman PBEPBE/SDD
converged: NO YES NO NO
title: Mulliken charges:
elementType: Cl N N N C C C C C C C C C C C H H H H H H H H H H H H
charge: 0.002946 -0.208939 -0.169091 -0.037082 0.439777 -0.278543 0.474687 -0.412730 -0.621424 -0.620635 -0.358387 -0.373883 -0.213441 -0.207386 -0.247713 0.259339 0.223185 0.218904 0.235842 0.218884 0.215308 0.243742 0.257395 0.272199 0.227566 0.229233 0.230246
chargesum: 0.00000
title: Mulliken charges with hydrogens summed into heavy atoms:
elementType: Cl N N N C C C C C C C C C C C
charge: 0.002946 -0.208939 -0.169091 -0.037082 0.439777 -0.278543 0.474687 -0.153391 0.056507 0.057299 -0.100992 -0.101684 0.014125 0.021847 -0.017467
polarizability: 2.37789688e+02 9.20160451e+00 1.44382509e+02 -3.17334900e+00 1.17440314e+01 8.06528805e+01
1716.lowfreq: -5.5084 -3.3692 -0.0009 -0.0007 0.0022 4.9385 29.7543 42.6855 48.6620
frequency: 29.6660 42.6667 48.6205 68.9239 103.1121 148.5215 172.7637 203.1936 214.8008 230.0292 279.6213 294.0931 306.1382 377.4361 397.0635 409.4094 467.0337 523.5950 552.6325 595.9117 607.2903 619.6797 661.2243 695.6141 707.1740 765.4450 805.6301 841.9064 910.4671 919.5384 940.6471 973.3887 988.4927 991.5152 1021.8476 1048.2978 1057.3952 1061.3044 1090.7880 1092.1153 1133.1683 1159.3405 1172.3881 1187.4744 1198.6304 1230.9245 1265.7524 1321.8190 1366.7734 1374.9094 1386.3525 1396.6464 1432.0321 1446.3987 1450.8765 1462.4769 1471.3188 1480.7170 1488.3991 1494.9176 1593.5647 1602.9853 1612.1179 2911.8947 2926.4113 3018.9858 3022.5450 3099.1946 3105.9733 3131.2182 3142.5565 3161.2052 3179.2461 3183.9128 3221.2220
redmass: 2.8768 3.3577 4.4383 1.5506 4.0715 3.2849 2.4189 5.2086 2.6974 1.7031 4.0337 4.5991 6.5616 5.5559 3.0948 2.9148 4.8329 5.3165 3.9283 8.3952 5.6299 6.8491 4.3153 2.0198 6.2289 1.6856 1.3903 1.2458 3.6134 1.6620 4.8258 1.3768 6.1997 1.3118 2.7393 3.2606 2.2464 1.5408 1.6807 1.2483 1.3658 2.6218 1.0522 1.1721 2.6441 3.0137 2.9906 1.3601 4.4654 5.8367 9.0358 4.6770 1.1424 2.0894 1.2934 1.0463 1.0636 1.0486 1.7854 1.4193 6.2359 5.9384 6.1553 1.0511 1.0487 1.0844 1.0877 1.0970 1.0963 1.0853 1.0904 1.0961 1.0947 1.0976 1.0970
irintensity: 1.1813 3.5786 1.1545 2.4809 0.6383 1.5819 5.1042 3.2797 1.3391 1.1232 0.9513 3.7169 0.1302 3.0424 0.4913 1.2148 2.4123 6.1134 2.7002 8.3548 6.0229 1.9177 5.2628 40.5516 16.2400 68.1247 30.3497 0.1988 10.3027 1.9246 80.9746 1.3829 0.1341 0.3285 3.1084 6.4295 42.8005 12.0158 8.2137 5.0774 15.4451 31.3864 0.2513 10.0398 48.6772 9.5542 16.0051 1.8034 46.0683 136.0245 14.0692 49.3143 2.9790 9.8727 2.0460 7.3892 67.5040 16.6411 95.4628 52.3828 50.2855 185.8309 25.3266 113.8165 138.9518 81.2547 20.6465 16.3705 28.2867 0.3954 17.9001 34.4802 6.3154 1.9648 3.7315
temp: 298.150 k
press: 1.00000 atm
elementType: 17 7 7 7 6 6 6 6 6 6 6 6 6 6 6 1 1 1 1 1 1 1 1 1 1 1 1
symmnumber: 1
zpe: 550876.4 jmol-1
zpe.correction: 0.209818 hartree
zpe.thermalcorrener: 0.224190 hartree
zpe.thermalcorrenthalpy: 0.225135 hartree
zpe.thermalcorrgfe: 0.166782 hartree
zpe.sumelectzpe: -1049.544693 hartree
zpe.sumelectthermal: -1049.530320 hartree
zpe.sumelectthermalent: -1049.529376 hartree
zpe.sumelectthermalfe: -1049.587729 hartree
dipole: -1.6638 0.9212 0.1697
dipole: 1.9094
quadrupole: -73.7948 -94.0724 -97.4107
quadrupole: 2.6283 -2.0540 3.1076
quadrupole: 14.6312 -5.6464 -8.9847 2.6283 -2.0540 3.1076
hfenergy: -1049.7545106 hartree
pointgroup: C01 [X(C11H12Cl1N3)]
dipole: 0.6436694 0.3777293 -0.0856341 debye
polarizability: 238.3261632|-6.0854792|141.80975|-0.1389423|-16.423881|82.689164 unknown
InChI: InChI=1S/C11H12ClN3/c1-14(2)10-8-13-15(11(10)12)9-6-4-3-5-7-9/h3-8H,1-2H3
charge 0 multiplicity 1
27 atoms
Cl 0.756961 2.292286 0.072623
N  -0.130214 -0.376941 -0.003952
N  3.493929 0.132034 0.213711
N  0.314977 -1.700505 0.02914
C  2.150852 -0.257235 0.1011
C  0.961541 0.504074 0.021988
C  -1.544055 -0.134358 -0.030112
C  1.670659 -1.614401 0.092357
C  4.511317 -0.583614 -0.572054
C  3.872545 1.481142 0.649988
C  -2.097788 0.948774 -0.755071
C  -2.389598 -1.042241 0.655279
C  -3.497258 1.13768 -0.760216
C  -3.78551 -0.849458 0.630325
C  -4.347327 0.245073 -0.069063
H  2.255292 -2.531187 0.141212
H  5.464029 -0.622335 -0.010844
H  4.708357 -0.093943 -1.553094
H  4.190522 -1.617816 -0.771467
H  3.868575 2.232653 -0.170353
H  4.894719 1.442135 1.071628
H  3.191815 1.832965 1.441363
H  -1.453348 1.626536 -1.319884
H  -1.940536 -1.886946 1.183992
H  -3.921666 1.978174 -1.32021
H  -4.434998 -1.553174 1.162344
H  -5.432191 0.395225 -0.080732
