program: Gaussian 09
title: 000209296
version: EM64L-G09RevD.01
frameworkgroup: C1[X(C14H28NO5PS2)]
method: RPBEPBE
basis: SDD
operation: Freq
keyword: #p
keyword: freq=noraman
keyword: PBEPBE/SDD
title: #p freq=noraman PBEPBE/SDD
converged: NO YES NO NO
title: Mulliken charges:
elementType: S S P O O O O O N C C C C C C C C C C C C C C H H H H H H H H H H H H H H H H H H H H H H H H H H H H
charge: 0.089510 -0.285135 0.612285 -0.252847 -0.256384 -0.254651 -0.449834 -0.457806 -0.360784 -0.005577 -0.428256 -0.165167 -0.722152 -0.718888 0.254437 0.302652 -0.865247 -0.267991 -0.669415 -0.219881 -0.234163 -0.650911 -0.654135 0.212103 0.210579 0.221157 0.295655 0.210417 0.238764 0.209125 0.216694 0.214791 0.208038 0.321406 0.315028 0.302914 0.228965 0.225147 0.263652 0.239705 0.211438 0.224540 0.232723 0.255758 0.231135 0.237071 0.233598 0.211955 0.235937 0.235123 0.216923
chargesum: 0.00000
title: Mulliken charges with hydrogens summed into heavy atoms:
elementType: S S P O O O O O N C C C C C C C C C C C C C C
charge: 0.089510 -0.285135 0.612285 -0.252847 -0.256384 -0.254651 -0.449834 -0.457806 -0.039378 0.206526 0.003481 0.130488 -0.063847 -0.079365 0.254437 0.302652 -0.247304 0.186120 0.045380 0.237382 0.252729 0.031714 0.033848
polarizability: 2.70226440e+02 -8.07429600e+00 2.24235874e+02 1.10190588e+00 -6.71959715e+00 2.31879110e+02
1716.lowfreq: -12.7420 -5.9255 -5.2162 0.0009 0.0010 0.0013 6.2315 19.2051 23.0743
frequency: -11.1847 18.6891 22.0115 28.2347 39.1253 41.1603 47.5839 51.8765 55.5927 64.9017 70.1429 74.4048 88.1671 92.2965 109.1490 115.0553 123.1696 142.9262 162.1355 170.2221 174.8446 200.6947 207.8950 215.3815 224.6390 229.5342 235.3277 249.6828 251.2222 265.4661 284.9744 299.4633 308.7886 321.7655 332.6309 363.2063 387.9934 393.3791 400.6966 427.0611 443.7185 469.8872 512.0558 535.1901 548.1411 624.6328 663.5864 674.4129 683.3260 719.8523 725.8438 745.4613 775.0752 783.8773 812.7973 814.5745 814.8534 842.3542 844.3966 867.5597 882.8314 912.0826 919.5438 935.8839 956.2400 981.5429 999.9753 1002.7930 1018.7849 1052.1833 1081.1423 1092.8661 1095.8232 1104.3613 1117.9865 1133.7088 1137.1033 1140.1991 1143.7370 1156.5551 1158.6213 1182.3230 1227.1621 1253.2255 1255.3850 1262.9486 1268.9851 1273.2999 1287.5830 1318.5259 1333.2686 1339.7260 1351.8974 1352.2939 1353.2442 1360.5713 1379.8103 1394.8587 1395.4297 1395.9862 1397.3122 1419.0243 1453.0331 1454.0251 1456.6974 1459.3448 1462.8545 1463.9841 1468.1151 1472.7122 1476.0367 1476.8899 1482.5365 1487.3309 1487.5366 1491.2485 1508.0741 1619.0977 1627.3099 2960.0092 2968.7514 2973.6223 2978.2045 2983.7182 2988.1799 2991.8934 2997.6754 3006.1920 3030.1970 3034.3707 3038.9023 3049.1446 3061.6447 3068.1734 3072.5572 3077.2570 3080.5107 3085.2622 3087.5538 3094.1236 3094.6623 3094.7285 3112.3020 3119.3749 3120.0145 3120.0444 3394.1239
redmass: 4.3190 4.0916 4.3444 4.2949 3.1056 3.0699 4.1466 4.0697 4.3048 2.5264 2.9060 2.9612 4.0458 4.7081 5.4284 4.6261 4.1079 7.0371 4.8491 3.5252 2.8175 2.2173 1.3287 1.5128 2.4009 1.5850 1.4384 2.1410 2.0879 2.2314 3.4001 3.1750 4.8015 3.8592 3.7928 5.1003 2.7538 4.2209 2.7571 2.3947 4.6680 3.1106 2.8208 11.9062 7.5204 5.3917 6.4552 3.7174 6.8053 1.4931 3.4654 4.8439 2.1926 1.1386 2.4618 1.1078 1.7834 2.3685 4.2029 3.9844 1.8749 2.0943 1.2624 2.2975 1.4158 2.2976 2.5846 2.4808 2.5829 3.5029 2.7589 2.2121 2.1515 2.2386 2.4194 1.4220 1.5463 1.7902 1.8916 1.7353 1.9622 1.8136 1.4212 1.2432 1.1527 1.1103 1.5345 1.1240 1.4520 1.3519 1.4026 1.3021 1.2907 1.3380 1.2476 1.4958 1.2101 1.2281 1.2359 1.2234 1.2098 1.1186 1.0769 1.0882 1.0399 1.0950 1.0410 1.0453 1.0535 1.0501 1.0553 1.0547 1.0574 1.0714 1.0577 1.0818 1.6110 7.5539 7.1438 1.0829 1.0357 1.0392 1.0563 1.0555 1.0364 1.0363 1.0369 1.0636 1.0600 1.0614 1.1018 1.1080 1.0993 1.0991 1.0993 1.0984 1.0990 1.0864 1.0987 1.0982 1.1013 1.0998 1.1021 1.1059 1.1012 1.1059 1.0806
irintensity: 1.4697 1.0242 0.1955 1.0265 0.1834 0.2529 1.5942 0.8599 1.9804 2.0489 1.3881 1.7458 0.5922 2.1308 6.2677 1.3380 3.3684 2.7445 2.8130 2.1325 2.5773 2.5036 1.9600 1.7942 8.2334 0.5015 2.0414 1.5209 1.2962 3.6988 8.9875 18.2154 8.2421 6.0168 4.1933 3.2493 4.1366 15.3786 2.1424 1.3891 31.5728 20.5881 0.9122 76.7744 19.6902 4.7493 50.2548 8.5805 130.1886 59.7667 20.2021 2.6622 7.9614 7.1960 2.3064 4.1961 3.8433 14.7510 141.3074 131.2004 1.5131 3.2376 3.8838 13.2922 0.1363 0.2781 24.5373 127.1461 94.6511 34.2860 4.4534 15.4750 29.9481 7.7501 84.7245 5.2705 2.6845 25.0833 91.6020 18.0799 41.8197 16.5268 7.8855 5.1146 0.3661 0.2026 6.0922 6.4980 53.3741 11.1421 25.6272 4.4602 9.6298 11.4573 5.9567 13.6265 16.8892 32.6639 31.0046 12.1549 18.1557 36.1804 9.3965 5.1386 11.6177 14.8287 12.0021 18.2364 4.0017 9.1179 17.6403 1.9798 6.6554 4.5539 17.0666 14.2665 168.4247 342.9113 19.9213 16.0495 32.2476 32.8453 24.3416 23.4541 15.0388 14.9168 25.4941 7.3590 32.7387 12.0805 13.6424 10.6875 12.0598 49.7565 57.0382 59.5507 26.3711 3.8594 23.8068 24.6769 6.2194 8.9472 26.6605 23.8011 7.2704 19.2624 179.8351
temp: 298.150 k
press: 1.00000 atm
elementType: 16 16 15 8 8 8 8 8 7 6 6 6 6 6 6 6 6 6 6 6 6 6 6 1 1 1 1 1 1 1 1 1 1 1 1 1 1 1 1 1 1 1 1 1 1 1 1 1 1 1 1
symmnumber: 1
zpe: 1088900.4 jmol-1
zpe.correction: 0.414740 hartree
zpe.thermalcorrener: 0.444716 hartree
zpe.thermalcorrenthalpy: 0.445660 hartree
zpe.thermalcorrgfe: 0.350137 hartree
zpe.sumelectzpe: -2116.672772 hartree
zpe.sumelectthermal: -2116.642797 hartree
zpe.sumelectthermalent: -2116.641853 hartree
zpe.sumelectthermalfe: -2116.737376 hartree
dipole: -1.7765 1.8440 -2.2072
dipole: 3.3805
quadrupole: -143.4793 -152.0907 -173.8768
quadrupole: 10.8939 -2.2805 6.5959
quadrupole: 13.0030 4.3916 -17.3946 10.8939 -2.2805 6.5959
hfenergy: -2117.0875124 hartree
pointgroup: C01 [X(C14H28N1O5P1S2)]
dipole: 0.6041451 -0.7763412 -0.8950962 debye
polarizability: 266.7545821|-14.7585126|227.0214919|0.0583874|6.1668258|232.5653492 unknown
InChI: InChI=1S/C10H18NO3S.C4H10O2PS/c1-4-14-10(13)8(5-7(2)3)11-9(12)6-15;1-3-5-7(8)6-4-2/h7-8,11H,4-6H2,1-3H3;3-4H2,1-2H3
charge 0 multiplicity 1
51 atoms
S  2.173769 0.618478 2.228708
S  1.988451 0.755299 -1.488134
P  2.478475 -0.393526 0.19004
O  -2.908614 -1.084865 1.618224
O  -1.687108 -1.336625 -0.354269
O  -0.991007 2.207074 2.735545
O  4.121446 -0.951406 0.276007
O  1.656738 -1.883476 0.42719
N  -0.839215 1.380279 0.551142
C  -4.402753 1.014532 -0.989544
C  -2.925182 1.456882 -0.817228
C  -2.241017 0.934067 0.469137
C  -5.296333 1.481445 0.184943
C  -4.946536 1.542556 -2.338185
C  -2.241291 -0.60522 0.502364
C  -0.306558 1.924773 1.706663
C  1.204917 2.155761 1.654854
C  -2.848306 -2.565474 1.860195
C  -1.581973 -2.910558 2.648842
C  5.206473 0.06761 0.132592
C  1.182651 -2.658539 -0.774339
C  6.519532 -0.69479 0.278378
C  2.340879 -3.304026 -1.532486
H  -4.429108 -0.095525 -1.025362
H  -2.340087 1.110273 -1.693075
H  -2.871075 2.56336 -0.798076
H  -2.744372 1.305937 1.375551
H  -6.350504 1.199125 0.006993
H  -4.989241 1.030134 1.145342
H  -5.255498 2.582438 0.29419
H  -4.330977 1.191279 -3.187363
H  -5.985295 1.203914 -2.507457
H  -4.946095 2.649713 -2.35322
H  -0.216959 1.173349 -0.244014
H  1.480356 2.93204 2.384635
H  1.57157 2.424013 0.647085
H  -2.878898 -3.081712 0.884455
H  -3.76698 -2.770831 2.431757
H  -0.673505 -2.674732 2.06855
H  -1.546814 -2.34649 3.596285
H  -1.574426 -3.990612 2.88734
H  5.083663 0.831831 0.924771
H  5.11208 0.550466 -0.858636
H  0.575009 -1.986153 -1.404736
H  0.515119 -3.401229 -0.30981
H  6.581197 -1.182728 1.265439
H  6.611657 -1.468264 -0.502602
H  7.3689 0.006142 0.179226
H  2.978915 -2.544582 -2.017878
H  2.967998 -3.909081 -0.856137
H  1.935833 -3.964722 -2.32219
