program: Gaussian 09
title: 000209286
version: EM64L-G09RevD.01
frameworkgroup: C1[X(C20H27N3O2)]
method: RPBEPBE
basis: SDD
operation: Freq
keyword: #p
keyword: freq=noraman
keyword: PBEPBE/SDD
title: #p freq=noraman PBEPBE/SDD
converged: YES YES NO NO
title: Mulliken charges:
elementType: O O N N N C C C C C C C C C C C C C C C C C C C C H H H H H H H H H H H H H H H H H H H H H H H H H H H
charge: -0.254100 -0.212989 -0.162168 -0.461896 0.031652 -0.398812 -0.390714 -0.391500 -0.361527 -0.373840 -0.456458 0.130872 0.373676 0.221741 -0.253442 -0.403462 0.274768 -0.353625 -0.380198 -0.292639 -0.268048 -0.341582 -0.209181 -0.377894 -0.688128 0.193447 0.220799 0.201980 0.198301 0.201120 0.206810 0.218850 0.185960 0.195044 0.236284 0.242103 0.233448 0.364325 0.304588 0.254132 0.213153 0.213488 0.201887 0.201900 0.216694 0.192852 0.192556 0.226385 0.241259 0.216204 0.213029 0.212894
chargesum: 0.00000
title: Mulliken charges with hydrogens summed into heavy atoms:
elementType: O O N N N C C C C C C C C C C C C C C C C C C C C
charge: -0.254100 -0.212989 -0.162168 -0.097571 0.031652 0.015434 0.009568 0.016430 0.043284 0.057488 0.019094 0.130872 0.373676 0.221741 -0.253442 -0.098874 0.274768 -0.099493 0.046444 0.111148 -0.051354 0.043825 0.017204 -0.136635 -0.046001
polarizability: 3.58761573e+02 -3.70709465e+00 2.78212340e+02 -8.59078282e+00 -3.77280876e+00 1.50711711e+02
1716.lowfreq: -8.0243 -2.3632 -0.0007 0.0007 0.0013 5.4537 10.4103 28.6387 33.3397
frequency: 8.2404 28.5611 33.2692 42.3262 51.3928 59.2579 76.1136 85.0052 97.4165 107.1160 134.5542 141.3274 148.1969 175.7171 187.8810 222.1618 226.1491 231.5109 245.8349 254.8010 291.0157 321.7816 337.6623 355.7299 387.7795 393.7054 422.1854 429.1543 448.3732 461.8937 470.4115 480.1286 496.3919 522.3136 561.3515 591.5515 605.9005 621.2095 639.0251 666.2676 712.4614 743.9884 759.2083 787.4657 790.7423 801.7687 811.3816 830.1898 834.8778 845.6506 852.0542 854.9748 879.7207 894.5553 900.6458 906.7023 927.9303 938.5244 939.6231 953.9039 972.8801 974.6348 981.9143 992.3467 1022.8028 1038.2031 1047.5377 1058.4978 1076.0201 1079.1181 1084.6404 1106.1859 1118.1101 1123.9737 1144.9031 1147.0224 1154.2581 1160.2642 1177.5723 1188.8465 1200.3219 1213.3662 1235.3168 1253.2742 1255.1317 1262.2345 1273.6532 1274.4254 1280.4799 1280.6857 1284.1888 1293.3141 1312.1304 1333.4632 1336.7223 1340.9306 1346.0515 1350.8935 1360.9302 1372.9986 1376.7691 1378.9093 1391.3761 1397.7083 1400.9350 1449.4719 1453.0718 1454.8419 1460.0728 1467.1431 1468.9650 1470.2132 1473.2042 1477.0510 1478.9069 1482.1886 1487.9367 1492.4657 1528.0097 1565.7194 1597.6194 1603.2590 1625.6783 2872.5667 2879.6528 2940.8815 2948.7875 2965.0591 2972.8063 2975.7113 2981.2046 2982.6072 2997.9586 2999.0195 3009.4282 3029.9278 3033.9331 3034.6616 3041.5205 3045.4187 3054.4761 3061.4603 3075.1564 3075.2032 3118.1787 3123.6556 3161.1547 3161.9587 3182.7845 3276.9958
redmass: 4.6173 4.1951 4.3681 3.2011 4.2789 1.5879 3.8682 5.5152 3.7692 4.2656 3.5082 2.5859 3.2838 3.6477 4.0091 3.7341 3.3240 1.1859 2.0864 7.5266 2.7398 2.5173 3.6616 3.9765 4.9172 2.0499 3.9166 3.4995 2.8633 5.2777 3.4161 2.5786 6.4008 5.9851 2.9991 3.4427 3.8381 2.8930 6.1439 4.2173 6.8920 1.0749 3.9437 1.9186 2.7253 1.5335 1.1672 4.2556 3.1175 1.7071 3.0033 1.4104 1.3295 3.5744 1.9469 2.2983 1.3782 1.1773 5.0991 1.3243 1.3520 1.4023 1.9364 2.5078 3.8427 3.3553 2.1524 3.2410 2.9700 1.4988 2.1774 2.5037 2.6372 2.6175 1.4479 1.4118 1.8917 1.5255 1.2797 2.3268 1.6164 1.3753 2.0316 1.6800 1.9056 1.3331 1.2374 1.3385 1.4505 1.7023 1.0598 1.3634 1.4624 1.3265 5.6054 1.4190 1.4655 1.4870 1.4175 1.7995 1.4461 1.8860 1.2373 2.3123 2.7399 1.0926 1.0962 2.4826 1.0908 1.1373 1.0951 1.0999 1.0993 1.0521 1.2399 1.1098 1.6509 1.2622 2.6343 5.5908 6.4737 6.3600 6.3392 1.0706 1.0696 1.0549 1.0648 1.0590 1.0636 1.0361 1.0616 1.0625 1.0596 1.1059 1.1011 1.0915 1.0924 1.0927 1.0941 1.1015 1.1038 1.1038 1.1012 1.0999 1.0873 1.0911 1.0986 1.0894 1.0950 1.0759
irintensity: 0.7580 0.0412 0.3456 0.4571 0.8054 0.3384 2.0408 3.8951 3.6013 0.8421 0.4078 6.2762 4.3618 1.0040 1.4025 0.6549 0.8648 0.0241 0.7313 4.5738 3.4903 4.6066 0.7069 0.4231 0.2735 1.1982 0.4722 0.9997 2.6627 38.7847 0.4236 14.8281 1.0148 0.2220 0.1225 1.7819 11.0993 0.5909 3.8253 1.3385 30.4857 11.0710 10.0585 25.7917 19.4568 3.9801 2.4831 2.8127 0.8782 52.7162 7.6956 7.5582 50.5999 19.9128 20.1734 4.5625 6.6301 0.3872 11.5237 7.3341 8.5073 2.3425 18.1323 25.9827 2.3903 0.8478 12.5178 29.2626 230.8235 3.3095 0.5587 25.2966 3.9332 5.6462 1.8621 3.2717 14.8032 7.6244 2.8376 39.9479 12.1886 0.0032 33.0765 86.0720 124.6201 0.9941 13.3518 24.9404 1.0979 2.2524 0.0176 5.4837 13.6687 0.6614 15.5290 0.3742 0.3468 1.0042 0.1497 36.8022 66.6195 23.1292 1.1419 0.5900 36.0265 26.1897 5.9859 13.2337 12.4395 71.9870 33.1926 0.8101 14.1030 19.4626 127.2392 24.5619 236.3317 35.6346 550.0877 24.6871 11.9004 10.0995 250.1095 46.2464 147.9615 35.2569 59.4106 37.0027 39.6817 39.2399 26.0271 25.6925 29.3325 28.5643 7.3947 17.0607 53.3278 40.8166 26.6344 26.5134 111.1344 9.8041 94.1623 62.3909 9.0487 27.9760 38.7351 11.1383 6.6052 300.8465
temp: 298.150 k
press: 1.00000 atm
elementType: 8 8 7 7 7 6 6 6 6 6 6 6 6 6 6 6 6 6 6 6 6 6 6 6 6 1 1 1 1 1 1 1 1 1 1 1 1 1 1 1 1 1 1 1 1 1 1 1 1 1 1 1
symmnumber: 1
zpe: 1151531.1 jmol-1
zpe.correction: 0.438595 hartree
zpe.thermalcorrener: 0.462686 hartree
zpe.thermalcorrenthalpy: 0.463630 hartree
zpe.thermalcorrgfe: 0.381920 hartree
zpe.sumelectzpe: -1091.158778 hartree
zpe.sumelectthermal: -1091.134687 hartree
zpe.sumelectthermalent: -1091.133743 hartree
zpe.sumelectthermalfe: -1091.215452 hartree
dipole: 3.9335 1.4635 0.3308
dipole: 4.2100
quadrupole: -113.0521 -158.5001 -149.9335
quadrupole: 15.9275 -1.6957 -0.7890
quadrupole: 27.4431 -18.0049 -9.4382 15.9275 -1.6957 -0.7890
hfenergy: -1091.5973727 hartree
pointgroup: C01 [X(C20H27N3O2)]
dipole: 1.5337758 0.4255383 0.4581374 debye
polarizability: 352.8105322|28.2243911|201.6655795|-22.6117421|58.6633622|233.2095126 unknown
InChI: InChI=1S/C20H27N3O2/c1-2-3-14-25-18-10-9-17(16-8-7-11-21-20(16)18)22-19(24)15-23-12-5-4-6-13-23/h7-11,22H,2-6,12-15H2,1H3
charge 0 multiplicity 1
52 atoms
O  1.890175 -1.824956 -2.971071
O  -3.684186 -0.451149 0.528667
N  4.377256 -0.035508 -0.91864
N  1.749163 -0.329621 -1.135867
N  -1.915935 1.11385 1.862615
C  6.155026 0.632922 1.333915
C  5.808587 1.658186 0.228864
C  5.024771 -0.412477 1.468888
C  5.48174 0.948606 -1.100731
C  4.719889 -1.066304 0.107293
C  3.909852 -0.653504 -2.185459
C  2.405286 -1.016507 -2.140039
C  0.384141 -0.374052 -0.759455
C  -0.047956 0.421096 0.368975
C  -1.438905 0.380417 0.789729
C  -0.551943 -1.167008 -1.437877
C  -2.371456 -0.458785 0.064601
C  -1.913064 -1.208352 -1.029393
C  -6.00629 -1.114508 0.529573
C  -4.662815 -1.301087 -0.177828
C  0.826363 1.270908 1.125084
C  -7.126956 -1.959073 -0.120413
C  0.333423 2.006221 2.20488
C  -1.051365 1.893878 2.537621
C  -8.485249 -1.77773 0.590575
H  7.101743 0.116934 1.071554
H  6.325391 1.147378 2.298034
H  6.648682 2.360736 0.069952
H  4.929894 2.257483 0.540019
H  4.10599 0.076896 1.849147
H  5.302405 -1.198252 2.196579
H  5.165513 1.686173 -1.861452
H  6.403287 0.443262 -1.484014
H  5.604631 -1.663879 -0.225921
H  3.866415 -1.763653 0.195273
H  4.04939 0.065415 -3.015287
H  4.464841 -1.576884 -2.459562
H  2.4312 0.24543 -0.605568
H  -0.216188 -1.761444 -2.290505
H  -2.598588 -1.846008 -1.593851
H  -5.891383 -1.391997 1.594658
H  -6.277303 -0.041872 0.506168
H  -4.33363 -2.361214 -0.136444
H  -4.724788 -0.990852 -1.242579
H  1.887405 1.359631 0.865216
H  -7.229694 -1.679909 -1.189121
H  -6.841686 -3.031011 -0.102567
H  0.986678 2.660756 2.790485
H  -1.467167 2.45939 3.380473
H  -9.274502 -2.387398 0.11401
H  -8.809003 -0.720497 0.561564
H  -8.418887 -2.07877 1.65283
