program: Gaussian 09
title: 000209278
version: EM64L-G09RevD.01
frameworkgroup: C1[X(C19H27N3O2)]
method: RPBEPBE
basis: SDD
operation: Freq
keyword: #p
keyword: freq=noraman
keyword: PBEPBE/SDD
title: #p freq=noraman PBEPBE/SDD
converged: YES YES NO NO
title: Mulliken charges:
elementType: O O N N N C C C C C C C C C C C C C C C C C C C H H H H H H H H H H H H H H H H H H H H H H H H H H H
charge: -0.213075 -0.256517 -0.183950 -0.461419 0.031534 -0.479608 -0.327963 -0.317134 0.371989 0.219989 0.140123 -0.253375 0.275567 -0.380184 -0.292647 -0.402637 -0.341684 -0.678998 -0.667384 -0.354389 -0.268807 -0.688128 -0.209334 -0.377781 0.243160 0.241522 0.232918 0.202432 0.200911 0.208618 0.213123 0.213504 0.366839 0.201923 0.201820 0.304944 0.192831 0.192600 0.224278 0.210735 0.226083 0.217786 0.216998 0.220307 0.254131 0.217883 0.212907 0.216209 0.213014 0.227107 0.241231
chargesum: 0.00000
title: Mulliken charges with hydrogens summed into heavy atoms:
elementType: O O N N N C C C C C C C C C C C C C C C C C C C
charge: -0.213075 -0.256517 -0.183950 -0.094580 0.031534 0.005074 0.107386 0.092395 0.371989 0.219989 0.140123 -0.253375 0.275567 0.046443 0.111096 -0.097693 0.043747 -0.017902 -0.012294 -0.100257 -0.050925 -0.045999 0.017773 -0.136550
polarizability: 3.48518764e+02 4.88889088e+00 2.68478890e+02 3.49763699e+00 -1.96470302e+00 1.49759791e+02
1716.lowfreq: -9.8459 -3.8969 -0.0010 -0.0005 0.0004 0.7951 13.7219 28.7948 34.6994
frequency: 13.5922 28.6907 34.6968 38.1766 48.7522 53.0332 64.4741 79.1011 90.7350 93.2847 99.7092 128.5173 137.0802 139.7446 175.4410 182.2626 200.6767 218.4600 226.2413 235.7832 247.6816 255.2014 274.0924 295.0499 328.8352 358.8764 387.0529 400.2883 422.8778 430.4579 448.6925 463.1757 470.1496 495.9813 518.5055 526.3005 572.7884 600.3432 621.1172 639.6486 666.2511 712.8937 741.4547 753.7646 785.1895 789.8470 796.3004 805.7981 811.8126 831.6364 834.3294 844.7864 877.6947 894.5112 903.6281 907.1898 929.4992 938.5516 939.3267 973.1087 975.4239 986.9309 994.5508 1021.8874 1038.2166 1056.4887 1064.6568 1074.1644 1076.2303 1084.4489 1089.2559 1110.9433 1124.5576 1144.0633 1153.1757 1160.3318 1188.0922 1197.3278 1205.1449 1212.9092 1233.9895 1244.3991 1253.4623 1274.5402 1276.9095 1281.3941 1283.0230 1285.7820 1289.0143 1325.0847 1336.1914 1346.8210 1362.0331 1370.1739 1373.4205 1378.0409 1391.8568 1393.3288 1395.7007 1397.7447 1400.1186 1449.0129 1454.4346 1467.6167 1469.0067 1470.7776 1471.8358 1475.4120 1477.8350 1479.7179 1480.6859 1484.4454 1486.7634 1490.8923 1492.5239 1527.7762 1564.8581 1596.9997 1602.6169 1624.6983 2895.3030 2901.1097 2940.3850 2957.5391 2965.0056 2975.6637 2984.7980 2985.9104 2997.8954 2998.5140 3009.0428 3029.0293 3046.1045 3048.3361 3061.3890 3074.9719 3075.4675 3080.7834 3082.7468 3085.0395 3088.2450 3117.9500 3123.3573 3161.3291 3161.6486 3182.3973 3262.0942
redmass: 4.2500 3.5477 3.6337 3.4074 1.8472 3.4755 3.4590 4.0607 2.3439 2.6700 3.3415 3.1486 4.1521 2.1581 3.7525 3.0439 2.3096 1.5979 3.4708 1.1360 2.0418 6.1626 2.4922 1.9375 2.5408 3.9046 5.6259 3.3734 3.9258 3.3854 2.7943 5.2441 3.4289 6.4458 3.9838 5.4261 3.7849 5.5428 2.9015 6.0554 4.2248 6.8595 1.0760 2.7303 2.9897 1.5240 1.1486 1.5094 1.1744 4.1494 2.8992 1.7969 1.4487 3.6314 1.8706 1.7857 1.3676 2.1498 1.7241 1.3509 1.3723 1.8881 2.3465 3.7913 3.3700 2.9494 2.8566 2.1868 2.4976 2.1893 2.1429 1.9020 2.6053 1.4468 1.7137 1.5018 2.3116 1.8414 2.0897 1.3732 2.0037 1.4608 2.4036 1.3372 1.3863 1.2061 1.8705 1.0635 1.1817 1.3874 5.4819 1.4530 1.3487 1.4442 1.6211 1.9720 1.2398 1.2414 1.3535 1.8480 2.8962 1.0832 2.5675 1.1172 1.0851 1.0663 1.0936 1.0919 1.0437 1.1286 1.1157 1.0671 1.5572 1.1210 1.2789 2.6009 5.5869 6.4945 6.4786 6.1404 1.0714 1.0706 1.0548 1.0662 1.0589 1.0360 1.0359 1.0360 1.0598 1.1055 1.1012 1.0903 1.0901 1.0929 1.1039 1.1016 1.0995 1.0988 1.0980 1.1002 1.1005 1.0875 1.0912 1.0964 1.0916 1.0950 1.0760
irintensity: 1.0610 0.0107 0.3503 0.5929 0.4318 0.5317 2.0522 2.4145 1.3459 0.1282 4.7672 1.1652 1.7991 3.9614 1.0795 2.2002 2.1043 0.8105 1.2116 0.0074 1.4783 2.7638 7.9546 1.4565 0.2972 0.6386 0.1007 1.2611 0.4452 0.4610 1.8736 43.2327 0.8802 3.8951 10.7560 0.7250 1.2396 13.6531 0.6030 4.8391 1.2375 27.6944 11.0409 11.2791 11.8197 39.4448 3.4649 1.6791 2.6627 2.4257 1.3038 48.8271 28.4178 14.1819 18.2499 23.3263 8.6972 8.3664 5.9919 8.5747 0.6750 8.5799 17.3496 6.9391 0.6703 8.6963 77.7134 146.4993 79.2203 0.4321 5.5822 17.7321 5.6975 1.8791 8.6978 12.0004 20.9879 47.8526 6.0821 0.0359 34.7758 23.7636 199.4875 13.5730 14.4237 1.0085 0.5574 0.0465 15.7789 1.2479 14.7975 0.8360 5.1107 8.5096 81.1628 35.2388 1.1996 17.2580 16.5431 7.2565 33.1510 9.7238 16.8440 65.1252 9.8387 3.0254 15.4243 81.0195 12.3659 62.5955 56.7053 14.4784 171.0424 4.1977 78.9162 560.4915 21.7102 11.0072 10.9538 244.2825 22.6549 177.9408 35.6345 58.1552 37.5590 39.4845 22.7968 17.4866 28.8370 29.1167 6.9921 9.3793 4.5491 14.8250 10.7652 103.0526 52.1731 23.3489 53.4483 77.7996 40.1353 9.8011 28.5238 47.1844 2.8595 6.8472 298.1115
temp: 298.150 k
press: 1.00000 atm
elementType: 8 8 7 7 7 6 6 6 6 6 6 6 6 6 6 6 6 6 6 6 6 6 6 6 1 1 1 1 1 1 1 1 1 1 1 1 1 1 1 1 1 1 1 1 1 1 1 1 1 1 1
symmnumber: 1
zpe: 1127450.1 jmol-1
zpe.correction: 0.429423 hartree
zpe.thermalcorrener: 0.454652 hartree
zpe.thermalcorrenthalpy: 0.455596 hartree
zpe.thermalcorrgfe: 0.371406 hartree
zpe.sumelectzpe: -1053.104210 hartree
zpe.sumelectthermal: -1053.078982 hartree
zpe.sumelectthermalent: -1053.078038 hartree
zpe.sumelectthermalfe: -1053.162227 hartree
dipole: -3.8443 1.4737 0.3868
dipole: 4.1352
quadrupole: -108.3361 -151.9183 -144.4948
quadrupole: -18.0154 -0.0984 -0.4611
quadrupole: 26.5803 -17.0019 -9.5784 -18.0154 -0.0984 -0.4611
hfenergy: -1053.5336335 hartree
pointgroup: C01 [X(C19H27N3O2)]
dipole: 1.4406922 0.5414052 0.5274236 debye
polarizability: 346.5807692|20.2379677|163.6981482|-6.4615129|35.0358844|256.4785279 unknown
InChI: InChI=1S/C19H27N3O2/c1-4-7-13-24-17-11-10-16(15-9-8-12-20-19(15)17)21-18(23)14-22(5-2)6-3/h8-12,21H,4-7,13-14H2,1-3H3
charge 0 multiplicity 1
51 atoms
O  -3.43631 -0.725393 0.563456
O  2.464155 -1.128924 -2.629907
N  4.680485 0.341111 -0.061426
N  2.160557 -0.428372 -0.383722
N  -1.787559 0.084079 2.559554
C  4.414376 -0.48635 -1.270973
C  4.65891 1.801376 -0.397825
C  5.908789 -0.075801 0.680536
C  0.762362 -0.527519 -0.179558
C  0.224739 -0.174025 1.115866
C  2.902284 -0.707495 -1.515763
C  -1.208912 -0.246397 1.346059
C  -2.075784 -0.682723 0.269984
C  -5.767379 -1.119052 0.070599
C  -4.3518 -1.166296 -0.507404
C  -0.110966 -0.950349 -1.191527
C  -6.830294 -1.569286 -0.958423
C  4.420296 2.7122 0.81946
C  5.719398 -1.388398 1.462042
C  -1.512611 -1.027807 -0.967897
C  1.031455 0.252462 2.222826
C  -8.261524 -1.523184 -0.381432
C  0.436489 0.580913 3.442605
C  -0.983743 0.483533 3.562546
H  4.869766 -1.48594 -1.148022
H  4.8423 -0.051752 -2.199462
H  3.8360 1.953974 -1.120979
H  5.60139 2.097188 -0.918088
H  6.7782 -0.165744 -0.013937
H  6.156965 0.729447 1.394048
H  -5.981028 -0.087843 0.410601
H  -5.809483 -1.766152 0.967276
H  2.791843 -0.079932 0.364073
H  -4.083922 -2.196367 -0.825217
H  -4.254527 -0.489131 -1.382558
H  0.305796 -1.220127 -2.164417
H  -6.603418 -2.600248 -1.299528
H  -6.773891 -0.922311 -1.85782
H  4.364272 3.766526 0.492667
H  5.230514 2.641415 1.567075
H  3.467633 2.457764 1.317744
H  6.649801 -1.650406 1.998386
H  5.468976 -2.236171 0.799142
H  4.906812 -1.285703 2.203019
H  -2.145709 -1.36391 -1.793266
H  2.12145 0.318307 2.13104
H  -8.526015 -0.498223 -0.060736
H  -9.008396 -1.848189 -1.128554
H  -8.353553 -2.184325 0.500514
H  1.038145 0.905207 4.297522
H  -1.479542 0.737145 4.507507
