program: Gaussian 09
title: 000209213
version: EM64L-G09RevD.01
frameworkgroup: C1[X(C20H31N3O)]
method: RPBEPBE
basis: SDD
operation: Freq
keyword: #p
keyword: freq=noraman
keyword: PBEPBE/SDD
title: #p freq=noraman PBEPBE/SDD
converged: NO YES NO NO
title: Mulliken charges:
elementType: O N N N C C C C C C C C C C C C C C C C C C C C H H H H H H H H H H H H H H H H H H H H H H H H H H H H H H H
charge: -0.283524 -0.114699 -0.300782 -0.096262 -0.381378 -0.360277 -0.409248 -0.355427 -0.354109 -0.257566 -0.330094 -0.340051 -0.693115 -0.692331 0.388695 -0.533368 0.195252 0.381690 -0.763841 -0.354291 -0.393663 -0.219617 -0.206260 -0.253902 0.198811 0.202290 0.206299 0.185650 0.217767 0.225220 0.189436 0.192912 0.205140 0.186603 0.215370 0.228990 0.181651 0.218783 0.191914 0.192485 0.208292 0.215802 0.206751 0.211790 0.216900 0.211236 0.264177 0.245205 0.228883 0.228876 0.287894 0.291423 0.220761 0.225025 0.225828
chargesum: 0.00000
title: Mulliken charges with hydrogens summed into heavy atoms:
elementType: O N N N C C C C C C C C C C C C C C C C C C C C
charge: -0.283524 -0.114699 -0.300782 -0.096262 0.019724 0.031672 0.033739 0.026921 0.037635 0.186795 0.070340 0.044349 -0.062270 -0.052405 0.388695 -0.269191 0.195252 0.381690 -0.060877 -0.066396 -0.102239 0.001144 0.018765 -0.028074
polarizability: 2.91816192e+02 -2.26321071e+01 2.67465486e+02 1.38296606e+00 3.78003078e+01 1.86548853e+02
1716.lowfreq: -9.2017 -4.7560 -1.3747 -0.0007 0.0002 0.0004 8.8277 13.2585 16.3830
frequency: 7.3973 12.9480 16.0641 23.9265 26.9678 36.9727 53.4194 57.2753 63.9290 84.6662 88.0092 106.8044 117.5327 129.3934 138.1482 148.5930 190.0653 199.0774 208.9665 214.1120 231.3180 236.2962 240.9557 268.9877 299.1682 308.1038 326.1745 357.4864 379.6765 388.3263 389.8987 408.4984 464.0332 468.0462 514.1103 535.1448 581.5530 612.6301 622.7556 641.1602 658.5808 668.6664 697.7639 731.2045 732.2456 765.7015 768.1338 774.7486 792.0067 795.7851 815.2122 818.8342 850.2205 877.7963 899.8429 925.5988 928.5392 941.0535 943.9046 976.5566 981.6435 983.7176 985.2124 990.7631 995.8186 1018.9454 1021.3777 1035.9761 1045.8034 1049.1437 1062.1358 1063.9794 1077.6167 1079.4260 1096.2055 1101.2656 1107.7540 1112.2451 1125.3302 1156.4122 1160.0589 1170.0208 1186.3954 1188.5202 1212.4681 1231.3491 1243.9098 1249.2618 1255.9789 1277.5410 1279.1770 1283.8609 1287.9715 1296.5352 1305.1337 1323.3733 1325.9679 1344.3073 1353.4747 1364.2191 1369.5364 1374.9106 1385.3213 1387.2207 1387.9660 1391.4275 1396.1457 1435.3341 1446.6040 1456.2912 1462.8316 1465.5881 1467.1402 1467.4017 1471.6306 1474.4875 1475.1765 1476.4080 1477.6331 1480.7826 1482.3531 1484.3345 1486.8512 1489.8951 1501.6745 1542.2524 1594.7382 1614.3631 2853.1750 2869.9792 2917.1949 2962.6391 2964.0610 2969.3020 2971.1639 2974.0528 2975.1491 2980.1204 2983.7333 3003.7611 3005.5517 3016.9583 3023.4720 3036.0207 3042.4142 3046.9009 3061.9501 3065.4719 3067.5849 3069.7116 3071.6383 3073.8708 3102.5738 3126.8611 3138.3744 3159.9860 3189.1791 3201.0068 3236.7613
redmass: 4.3573 3.9057 3.4513 3.6192 3.4576 1.8812 2.2882 4.3065 2.1160 2.8222 2.7377 1.1902 2.3835 2.8367 2.9940 2.8064 3.5908 3.9695 2.7269 1.4036 1.2281 4.5842 1.9000 2.5443 2.8825 3.0831 2.8524 4.6212 5.5362 3.0510 3.7441 2.9503 2.9174 2.7358 3.3104 2.9686 4.5768 6.0164 5.6011 7.0851 3.3616 6.7238 2.0600 1.1160 1.2313 1.6589 2.5979 1.4717 1.3356 1.6645 1.4817 1.8245 1.2451 1.5996 1.7324 1.4242 1.2315 3.4383 1.8016 1.8115 1.3516 2.1605 5.4805 5.0178 1.3089 3.8350 3.2855 2.1060 1.4869 2.6813 2.6076 2.5306 2.3856 1.8921 2.1664 2.1175 2.3086 2.2106 1.9386 1.5859 1.4323 1.0523 2.1627 1.1282 1.4398 1.4008 1.5312 3.0637 1.4262 1.3148 1.1091 1.1243 1.1794 1.2362 1.2907 1.3171 1.4054 1.5152 1.6112 1.3639 1.8532 1.9061 5.5223 1.4361 1.4317 1.2427 1.3360 2.4151 2.7802 1.0881 4.5441 1.0735 1.0458 1.0856 1.0700 1.0769 1.0589 1.0548 1.0435 1.0691 1.5139 1.0867 1.0891 1.0905 2.7115 5.6168 6.8806 6.0610 1.0711 1.0701 1.0699 1.0613 1.0587 1.0512 1.0469 1.0507 1.0461 1.0566 1.0372 1.0926 1.0975 1.0923 1.0904 1.1010 1.0972 1.1004 1.0980 1.1016 1.1009 1.0990 1.1007 1.0994 1.0983 1.0852 1.0910 1.0980 1.0945 1.0939 1.0986
irintensity: 0.0123 0.0045 0.0494 0.0706 0.0466 0.0785 0.0092 0.0449 0.1110 0.4639 3.8513 0.1988 0.1339 0.2512 1.0237 0.9648 0.4429 0.0880 2.7635 0.3847 0.2520 1.6519 0.1124 0.9780 2.9069 0.7977 0.7654 7.0767 2.0439 1.8161 6.7254 0.0677 4.8524 6.4510 12.3301 1.2131 1.8274 8.0024 19.4946 1.9847 4.4070 23.2754 37.8896 4.3361 7.8051 19.8463 30.7897 78.1171 1.0860 0.6847 1.1794 0.3419 0.1302 0.6552 11.9222 9.1057 4.3664 105.8830 12.3138 9.3046 0.0196 8.7965 1.4306 1.8084 1.9629 54.0031 34.6391 18.8110 5.5107 13.3314 2.8839 55.9879 8.5133 18.1068 17.0327 15.3962 25.4557 1.1774 6.5785 57.0368 3.6569 0.6419 23.0943 5.7133 6.6997 11.4495 14.4132 28.2449 14.2861 4.2846 0.5080 6.2347 3.6236 16.4867 6.9599 1.6130 19.3189 0.9281 4.6201 4.1580 35.3400 30.3338 1.7753 15.9370 12.0355 13.9250 31.7300 136.8796 5.3826 3.5493 0.6162 2.4039 15.0830 8.2913 2.6645 9.1251 16.1230 8.5300 13.4300 2.0779 85.9413 5.2601 19.5051 15.7849 193.3821 207.6751 18.9122 80.5779 65.4301 117.5167 71.3371 16.4530 15.1197 27.0255 86.6571 39.6412 61.3350 29.7466 41.3926 11.0002 6.4875 26.3240 15.9516 31.4650 3.0400 56.5556 19.3826 29.6459 113.8253 46.2632 89.4855 51.8528 11.5640 0.2277 26.0838 35.5864 2.9019 4.1814 4.1333
temp: 298.150 k
press: 1.00000 atm
elementType: 8 7 7 7 6 6 6 6 6 6 6 6 6 6 6 6 6 6 6 6 6 6 6 6 1 1 1 1 1 1 1 1 1 1 1 1 1 1 1 1 1 1 1 1 1 1 1 1 1 1 1 1 1 1 1
symmnumber: 1
zpe: 1244703.7 jmol-1
zpe.correction: 0.474083 hartree
zpe.thermalcorrener: 0.500849 hartree
zpe.thermalcorrenthalpy: 0.501793 hartree
zpe.thermalcorrgfe: 0.410463 hartree
zpe.sumelectzpe: -1018.309864 hartree
zpe.sumelectthermal: -1018.283098 hartree
zpe.sumelectthermalent: -1018.282153 hartree
zpe.sumelectthermalfe: -1018.373483 hartree
dipole: -4.2141 -0.4205 -0.7096
dipole: 4.2941
quadrupole: -148.9140 -139.3783 -147.3956
quadrupole: -1.3599 1.6911 4.5803
quadrupole: -3.6847 5.8510 -2.1663 -1.3599 1.6911 4.5803
hfenergy: -1018.7839463 hartree
pointgroup: C01 [X(C20H31N3O1)]
dipole: 1.5391593 -0.5505932 0.4265798 debye
polarizability: 270.8042609|-11.8672594|231.241478|6.9731775|-66.1944828|243.7847928 unknown
InChI: InChI=1S/C20H31N3O/c1-4-6-13-22(14-7-5-2)15-16-24-20-17-18(3)21-23(20)19-11-9-8-10-12-19/h8-12,17H,4-7,13-16H2,1-3H3
charge 0 multiplicity 1
55 atoms
O  -0.633521 0.210971 -0.887186
N  2.774655 -0.948701 0.130182
N  -2.977081 0.733648 -1.149087
N  -4.224746 0.428096 -0.552459
C  3.060121 -2.297342 -0.429704
C  3.98974 -0.160636 0.458615
C  1.747225 -0.195646 -0.623847
C  3.453783 -3.336056 0.645647
C  3.762139 0.859972 1.593829
C  0.359468 -0.511352 -0.051717
C  2.314636 -3.644159 1.641568
C  5.02577 1.694055 1.907004
C  2.736031 -4.636103 2.746815
C  4.793766 2.724237 3.033468
C  -1.948269 0.064178 -0.485795
C  -2.521793 -0.685774 0.551201
C  -3.929264 -0.425299 0.464984
C  -2.95182 1.634592 -2.26259
C  -5.030566 -0.969672 1.33171
C  -1.750234 1.932912 -2.955717
C  -4.173178 2.231717 -2.671021
C  -1.78212 2.828661 -4.046831
C  -4.185141 3.122139 -3.762827
C  -2.992373 3.429205 -4.459389
H  2.144446 -2.655323 -0.939616
H  3.857893 -2.245795 -1.211869
H  4.776287 -0.869739 0.778428
H  4.390879 0.369521 -0.442817
H  1.758713 -0.427633 -1.713623
H  1.930154 0.888978 -0.526233
H  4.342494 -2.979766 1.205658
H  3.765375 -4.269527 0.132302
H  3.433456 0.31256 2.498927
H  2.934577 1.547826 1.325068
H  0.142688 -1.597115 -0.091007
H  0.282627 -0.16376 0.995873
H  1.447547 -4.056739 1.084206
H  1.977692 -2.690593 2.091666
H  5.356672 2.2193 0.987495
H  5.854275 1.013433 2.191472
H  3.579481 -4.233033 3.338998
H  1.903405 -4.842768 3.444294
H  3.061992 -5.601934 2.315704
H  4.489715 2.224055 3.972124
H  5.708419 3.308713 3.242441
H  3.99269 3.436162 2.758996
H  -2.012205 -1.326198 1.266263
H  -6.00206 -0.570433 0.99682
H  -5.071896 -2.073489 1.283569
H  -4.884421 -0.688697 2.391052
H  -0.810511 1.47395 -2.646428
H  -5.085152 1.98346 -2.12436
H  -0.849594 3.053993 -4.576859
H  -5.133077 3.578289 -4.069791
H  -3.007386 4.122458 -5.307307
