program: Gaussian 09
title: 000209200
version: EM64L-G09RevD.01
frameworkgroup: C1[X(C19H13ClO4S)]
method: RPBEPBE
basis: SDD
operation: Freq
keyword: #p
keyword: freq=noraman
keyword: PBEPBE/SDD
title: #p freq=noraman PBEPBE/SDD
converged: YES YES NO NO
title: Mulliken charges:
elementType: Cl S O O O O C C C C C C C C C C C C C C C C C C C H H H H H H H H H H H H H
charge: -0.071687 0.220691 -0.390291 -0.246324 -0.380172 -0.221294 -0.675148 0.409960 0.477657 0.043221 -0.451746 0.348504 -0.321227 0.399101 -0.393751 -0.369673 -0.361645 -0.385126 0.057916 -0.214585 -0.217887 -0.104159 -0.225238 -0.234126 -0.231187 0.232192 0.261565 0.242536 0.282748 0.250676 0.288430 0.250264 0.252732 0.234593 0.239048 0.237369 0.381202 0.384863
chargesum: 0.00000
title: Mulliken charges with hydrogens summed into heavy atoms:
elementType: Cl S O O O O C C C C C C C C C C C C C C C C C C C
charge: -0.071687 0.220691 -0.009089 -0.246324 0.004691 -0.221294 -0.181391 0.409960 0.477657 0.043221 -0.451746 0.348504 -0.321227 0.399101 -0.151215 -0.086925 -0.110970 -0.096697 0.057916 0.035678 0.034845 -0.104159 0.009356 0.004922 0.006182
polarizability: 3.43742206e+02 5.06501421e+00 2.30404846e+02 7.00672793e+00 -1.07923974e+01 1.84629806e+02
1716.lowfreq: -3.1076 -0.0003 0.0011 0.0013 3.1939 8.3259 17.1017 18.8861 36.4486
frequency: 16.9575 18.5678 36.4176 44.6608 49.4637 53.8403 72.3356 87.2210 103.3576 126.2017 138.3952 147.8246 183.3814 204.0224 223.0172 235.4727 265.3568 280.2402 286.8209 289.0380 312.1068 344.4139 387.4789 394.6674 403.2196 409.5843 420.0304 450.9434 467.7969 491.0588 517.9075 529.2774 545.3010 570.0028 595.3704 609.4104 617.2348 624.4497 627.1243 650.6013 667.9901 701.9088 721.1775 756.6603 765.7975 770.1779 799.9697 831.8094 841.2639 851.0842 856.8825 865.6279 924.2991 937.2322 941.5029 956.1611 977.7277 983.6096 987.5347 1000.1927 1003.3708 1030.2073 1047.5654 1070.3141 1090.3201 1095.6464 1110.0193 1161.9015 1175.0863 1177.5420 1184.6688 1199.9874 1204.4386 1229.2077 1233.3057 1296.3135 1303.6398 1306.0123 1325.0758 1344.5432 1374.4543 1377.6262 1397.8687 1433.6869 1452.9283 1474.8235 1476.4602 1502.6384 1577.5876 1584.6852 1587.3129 1597.4228 1607.2380 1633.3012 1650.5931 3022.0947 3086.9830 3130.9810 3138.7937 3139.0664 3144.8503 3151.2965 3163.6909 3167.2720 3170.7970 3174.2811 3501.4638 3559.7316
redmass: 9.4650 6.6968 4.6183 7.6587 7.4932 5.0439 6.8077 6.9180 8.3430 9.6886 7.2881 6.6283 7.9559 2.1945 2.2030 6.0900 6.8203 5.8827 5.4045 8.5778 8.0557 7.1719 2.7993 5.5730 2.8551 2.9696 6.5638 6.5809 5.3753 5.2103 4.4226 4.6341 3.1740 5.1157 5.1367 5.9790 6.0707 3.5576 5.2321 3.1740 5.3890 1.9110 4.0493 4.4400 2.7039 3.4978 2.6676 1.3665 4.0641 2.3656 1.2495 5.2354 4.3751 1.5166 1.7698 1.5845 1.3517 1.3972 5.8204 4.6282 1.3279 2.1894 3.4097 2.6499 1.6562 2.1338 1.9829 1.9155 1.7601 1.0907 1.1495 1.1322 2.7513 2.7701 1.7891 1.3639 2.2374 1.4439 1.4658 4.8273 6.2723 6.9856 2.5106 2.2912 1.1690 2.4062 2.1840 7.0572 6.4883 8.0802 7.3746 6.1873 5.9469 8.1595 9.7671 1.0589 1.1032 1.0857 1.0893 1.0887 1.0900 1.0934 1.0968 1.0956 1.0968 1.1005 1.0638 1.0667
irintensity: 0.6689 0.7837 0.5396 1.1239 0.4740 0.6473 4.6989 4.4790 0.3501 2.1796 1.1094 2.7215 3.1347 49.1021 67.8695 8.2153 4.2208 0.8272 1.0208 0.9086 1.9423 7.0663 10.9739 7.4910 0.2768 0.1893 3.0381 3.1663 9.0956 13.7359 9.3690 19.0066 64.6850 24.6498 24.6750 47.2989 1.4863 46.3851 20.9971 34.0303 3.5210 44.9329 16.7137 4.6309 32.8579 49.3770 35.1381 1.3983 15.8399 47.8670 2.4074 3.0758 2.1071 4.9309 22.8413 6.7301 3.6265 2.6925 3.4344 40.8342 0.4649 9.3979 174.2710 26.8246 4.0860 84.3907 219.3803 121.0220 26.1107 0.8384 12.9159 4.8356 2.2428 15.2479 16.7246 0.8586 14.7123 6.3788 4.6362 203.9628 3.4831 3.9940 7.8364 14.7108 35.1550 108.4882 28.3056 164.3914 13.6424 16.6215 2.8113 6.1991 2.0503 131.6399 237.9240 17.0612 1.9354 1.7384 6.9763 4.1066 0.2248 19.0506 13.6790 6.5706 2.5263 17.4564 33.1558 68.1588
temp: 298.150 k
press: 1.00000 atm
elementType: 17 16 8 8 8 8 6 6 6 6 6 6 6 6 6 6 6 6 6 6 6 6 6 6 6 1 1 1 1 1 1 1 1 1 1 1 1 1
symmnumber: 1
zpe: 704829.4 jmol-1
zpe.correction: 0.268455 hartree
zpe.thermalcorrener: 0.291250 hartree
zpe.thermalcorrenthalpy: 0.292194 hartree
zpe.thermalcorrgfe: 0.213103 hartree
zpe.sumelectzpe: -1889.079132 hartree
zpe.sumelectthermal: -1889.056338 hartree
zpe.sumelectthermalent: -1889.055393 hartree
zpe.sumelectthermalfe: -1889.134485 hartree
dipole: 5.0169 -4.8983 1.4617
dipole: 7.1623
quadrupole: -158.0390 -142.2847 -160.6277
quadrupole: 1.5227 16.2996 8.3528
quadrupole: -4.3885 11.3657 -6.9772 1.5227 16.2996 8.3528
hfenergy: -1889.3475876 hartree
pointgroup: C01 [X(C19H13Cl1O4S1)]
dipole: 2.093329 1.1739636 -1.4765651 debye
polarizability: 343.3245489|-4.8263316|202.1318026|8.8641652|-25.2717996|213.3205066 unknown
InChI: InChI=1S/C19H13ClO4S/c20-13-8-6-11(7-9-13)10-14-16(21)15(18(22)23)17(25-19(14)24)12-4-2-1-3-5-12/h1-9,22,24H,10H2
charge 0 multiplicity 1
38 atoms
Cl -6.503616 -1.62683 -2.150638
S  1.320959 1.834441 -0.936039
O  -1.115759 3.0208 -0.822405
O  -0.720328 -0.612785 2.273512
O  1.357556 -2.621532 1.056097
O  2.464366 -1.413568 2.703925
C  -2.332379 1.458327 1.204983
C  -0.904187 1.208154 0.72575
C  -3.369659 0.69673 0.377505
C  -0.170873 0.096021 1.356128
C  1.97358 0.393423 -0.018576
C  1.215673 -0.24014 0.933922
C  -0.362476 1.991401 -0.262782
C  3.361597 0.061781 -0.435543
C  -4.132678 1.360039 -0.616107
C  -3.581453 -0.691198 0.588143
C  3.688235 -0.052335 -1.815728
C  4.385942 -0.113973 0.5367
C  1.76065 -1.441557 1.673441
C  -5.088405 0.662241 -1.389971
C  -4.531177 -1.404948 -0.176379
C  -5.269348 -0.713448 -1.155937
C  5.007142 -0.351183 -2.215167
C  5.7040 -0.409143 0.128537
C  6.020008 -0.530332 -1.244261
H  -2.545649 2.539624 1.167297
H  -2.376774 1.120843 2.255226
H  -3.977264 2.430364 -0.791468
H  -2.996108 -1.210737 1.354697
H  2.903096 0.06578 -2.571118
H  4.152857 -0.00727 1.600171
H  -5.679525 1.177437 -2.152747
H  -4.694285 -2.473791 -0.01008
H  5.242627 -0.449662 -3.280209
H  6.48473 -0.538069 0.885656
H  7.045106 -0.759551 -1.555039
H  -0.633751 3.527825 -1.52388
H  1.654468 -3.399678 1.603588
