program: Gaussian 09
title: 000209198
version: EM64L-G09RevD.01
frameworkgroup: C1[X(C19H14O4S)]
method: RPBEPBE
basis: SDD
operation: Freq
keyword: #p
keyword: freq=noraman
keyword: PBEPBE/SDD
title: #p freq=noraman PBEPBE/SDD
converged: YES YES NO NO
title: Mulliken charges:
elementType: S O O O O C C C C C C C C C C C C C C C C C C C H H H H H H H H H H H H H H
charge: 0.216616 -0.389974 -0.244437 -0.380120 -0.222672 -0.670515 0.410641 0.458495 -0.451760 0.042468 0.348389 -0.319921 0.398131 -0.401066 -0.383322 -0.362245 -0.385545 0.057299 -0.229170 -0.231490 -0.243903 -0.225478 -0.234444 -0.231941 0.229503 0.257773 0.236546 0.273710 0.250644 0.288698 0.219864 0.222989 0.224415 0.233671 0.238349 0.236515 0.379523 0.383765
chargesum: 0.00000
title: Mulliken charges with hydrogens summed into heavy atoms:
elementType: S O O O O C C C C C C C C C C C C C C C C C C C
charge: 0.216616 -0.010451 -0.244437 0.003645 -0.222672 -0.183239 0.410641 0.458495 -0.451760 0.042468 0.348389 -0.319921 0.398131 -0.164520 -0.109612 -0.111601 -0.096846 0.057299 -0.009306 -0.008502 -0.019488 0.008193 0.003905 0.004574
polarizability: 3.22653520e+02 3.18762435e+00 2.30886572e+02 8.23724802e-01 -9.62924247e+00 1.66980835e+02
1716.lowfreq: 0.0012 0.0014 0.0019 1.2950 6.6043 9.4879 21.2189 22.0824 38.6838
frequency: 20.9741 21.8170 38.6721 45.9156 55.1197 61.9997 73.4893 89.9281 120.7638 142.0899 147.8327 183.0408 187.8129 210.0342 219.8567 251.1142 270.2942 290.1378 318.8179 341.7586 384.9700 403.0539 404.3703 418.8700 440.8706 459.8355 483.3457 516.3617 522.6209 537.6853 546.9394 584.4249 598.3698 616.6015 617.7647 623.0752 645.7963 668.2961 702.7375 706.3659 755.7852 758.3489 764.3389 769.3413 821.5331 844.3256 857.5159 857.9505 865.3381 918.6863 930.7290 937.8920 948.1165 981.0886 984.3125 987.4826 989.3671 996.0696 1003.2559 1027.7975 1030.2640 1045.7044 1077.9561 1090.3921 1102.6070 1158.9623 1170.5814 1174.1969 1177.1582 1189.0484 1199.6775 1204.7538 1228.2600 1232.1082 1301.2303 1302.9216 1323.9589 1330.7694 1343.5136 1374.2722 1382.7341 1433.5282 1441.4623 1454.5622 1476.7257 1481.9950 1503.9310 1577.8609 1585.2033 1592.5604 1607.6287 1611.6545 1632.7119 1650.3750 3021.3336 3085.5688 3118.0714 3126.5069 3130.6912 3138.8749 3138.8983 3147.7500 3151.2278 3161.3940 3163.7972 3174.5794 3501.9632 3561.4142
redmass: 4.8237 6.4668 5.3097 6.4305 4.3596 7.4808 6.0486 6.1867 8.4530 4.5015 6.2573 1.7829 3.7059 4.8865 5.3227 6.4182 7.3989 7.3452 7.5239 6.1356 2.3089 2.8653 2.8832 7.0103 5.3351 6.4103 5.2962 4.6730 6.6289 3.2285 3.9904 5.5969 4.6138 5.7591 6.1976 3.4029 3.2214 5.5435 1.9124 1.7972 3.9728 2.2380 3.6441 2.5150 4.0519 6.8479 1.2460 1.2549 5.1953 2.6488 2.0325 1.4822 2.0433 1.3724 1.3885 5.9255 5.7014 1.3357 1.3257 2.2849 2.1843 3.3102 1.6849 1.6467 3.5432 1.8161 1.1084 1.7372 1.0869 1.1402 1.1292 2.6632 2.3325 2.0465 1.9045 1.7388 1.5071 1.3432 3.6112 6.1301 7.3834 2.2960 2.1775 1.1619 2.2040 2.2867 6.9986 6.3715 8.2326 6.0871 5.9567 6.0487 8.1494 9.7576 1.0587 1.1033 1.0843 1.0878 1.0856 1.0889 1.0927 1.0964 1.0935 1.1016 1.0970 1.1002 1.0638 1.0667
irintensity: 1.4153 0.7336 0.9525 0.9632 0.3684 0.8897 6.0416 4.4124 2.6459 11.2947 2.7568 68.4343 28.5225 6.4077 11.4755 3.1507 3.6788 1.0738 3.2304 3.2385 2.9921 0.2402 0.2406 1.4196 5.5016 1.0336 14.1057 13.2625 10.9592 26.0899 45.0467 23.9889 54.0778 4.1879 0.2381 66.8124 33.5016 4.3911 46.3213 60.5221 1.4491 37.8496 28.2757 55.6605 1.1217 25.7820 2.7175 0.9659 3.2513 6.7878 6.3412 4.1437 21.6981 1.1104 2.9491 3.0094 0.0991 1.3665 0.6357 3.6813 11.0528 172.9963 12.0664 4.6022 284.4855 135.7374 0.8756 25.9944 0.9027 9.2189 4.2679 1.9624 11.1845 18.5220 9.3270 7.9747 10.5570 16.0727 181.4100 3.3616 1.0020 14.1274 11.0846 31.0057 8.0935 46.5050 166.8425 11.8008 19.0824 1.1719 1.9707 11.2288 129.0154 237.3687 18.4256 1.8607 1.6499 5.7683 1.4699 5.5566 23.8622 24.4158 19.8865 27.9234 15.0313 16.3733 32.0432 65.7842
temp: 298.150 k
press: 1.00000 atm
elementType: 16 8 8 8 8 6 6 6 6 6 6 6 6 6 6 6 6 6 6 6 6 6 6 6 1 1 1 1 1 1 1 1 1 1 1 1 1 1
symmnumber: 1
zpe: 730239.1 jmol-1
zpe.correction: 0.278133 hartree
zpe.thermalcorrener: 0.299648 hartree
zpe.thermalcorrenthalpy: 0.300592 hartree
zpe.thermalcorrgfe: 0.225034 hartree
zpe.sumelectzpe: -1429.687896 hartree
zpe.sumelectthermal: -1429.666381 hartree
zpe.sumelectthermalent: -1429.665437 hartree
zpe.sumelectthermalfe: -1429.740995 hartree
dipole: 3.2373 -4.8991 2.2640
dipole: 6.2934
quadrupole: -132.2428 -133.4871 -144.7916
quadrupole: 3.3666 3.4697 7.9598
quadrupole: 4.5977 3.3534 -7.9511 3.3666 3.4697 7.9598
hfenergy: -1429.966029 hartree
pointgroup: C01 [X(C19H14O4S1)]
dipole: 1.3861301 1.2791176 -1.6040879 debye
polarizability: 321.9635282|-8.2165123|211.8873403|2.6446729|-31.2421661|186.6700582 unknown
InChI: InChI=1S/C19H14O4S/c20-16-14(11-12-7-3-1-4-8-12)19(23)24-17(15(16)18(21)22)13-9-5-2-6-10-13/h1-10,21,23H,11H2
charge 0 multiplicity 1
38 atoms
S  1.02204 2.025944 -0.381586
O  -1.471228 3.050978 -0.091147
O  -1.049337 -1.296364 1.881556
O  1.150613 -2.816369 0.250449
O  2.143173 -2.099593 2.224939
C  -2.722277 0.923278 1.307726
C  -1.255912 0.874347 0.883011
C  -3.661033 0.392361 0.220366
C  1.692899 0.399501 0.11451
C  -0.497863 -0.342838 1.224858
C  0.920387 -0.502982 0.801041
C  -0.701753 1.925763 0.196305
C  3.111388 0.240639 -0.302644
C  -4.362759 1.28575 -0.628592
C  -3.83663 -1.004998 0.041098
C  3.503766 0.536289 -1.638063
C  4.098157 -0.178476 0.633244
C  1.482253 -1.850285 1.195687
C  -5.222145 0.795469 -1.6385
C  -4.694713 -1.495241 -0.96861
C  -5.390169 -0.597741 -1.812746
C  4.850529 0.400542 -2.03347
C  5.444369 -0.30795 0.230735
C  5.825958 -0.021791 -1.100311
H  -2.994115 1.961406 1.562661
H  -2.810833 0.297063 2.21257
H  -4.230025 2.36597 -0.496123
H  -3.294993 -1.696942 0.696084
H  2.748647 0.845383 -2.369638
H  3.813512 -0.388636 1.668383
H  -5.762582 1.497684 -2.284104
H  -4.823294 -2.576514 -1.094611
H  -6.058021 -0.979374 -2.593611
H  5.137132 0.618354 -3.067896
H  6.195229 -0.627322 0.961236
H  6.872567 -0.12392 -1.407252
H  -0.9863 3.737617 -0.615222
H  1.453864 -3.709903 0.57137
