program: Gaussian 09
title: 000209196
version: EM64L-G09RevD.01
frameworkgroup: C1[X(C13H16NOS)]
method: RPBEPBE
basis: SDD
operation: Freq
keyword: #p
keyword: freq=noraman
keyword: PBEPBE/SDD
title: #p freq=noraman PBEPBE/SDD
converged: YES YES NO NO
title: Mulliken charges:
elementType: S O N C C C C C C C C C C C C C H H H H H H H H H H H H H H H H
charge: 0.400856 -0.229091 -0.174968 -0.246900 -0.379561 0.601715 0.461845 -0.674197 -0.642668 -0.761385 -0.289427 -0.317832 -0.371306 -0.339551 0.344118 -0.531218 0.273438 0.256781 0.314930 0.236769 0.260421 0.230176 0.257869 0.269981 0.254549 0.241764 0.252765 0.266409 0.282513 0.239336 0.237766 0.274100
chargesum: 1.00000
title: Mulliken charges with hydrogens summed into heavy atoms:
elementType: S O N C C C C C C C C C C C C C
charge: 0.400856 -0.229091 -0.174968 -0.246900 0.150658 0.601715 0.461845 -0.359267 0.084698 0.021015 -0.047664 -0.065067 -0.104896 -0.057038 0.344118 0.219984
polarizability: 3.12944720e+02 -1.10923765e+01 1.64509139e+02 -1.58326857e+00 -1.77048306e+00 8.86720592e+01
1716.lowfreq: -7.9457 -4.5646 0.0014 0.0018 0.0026 3.2987 42.5324 52.8139 66.0137
frequency: 42.4576 52.7952 65.9903 104.4586 128.6447 138.8884 157.8058 179.0173 189.0418 202.5501 216.4170 245.1558 256.3772 291.5271 320.6595 360.3055 398.7841 411.9890 426.2048 466.7112 511.4068 532.2979 553.5273 562.1648 598.2218 627.8640 663.1873 728.6012 757.7227 773.0702 781.1553 804.4157 816.1896 827.7076 848.0364 917.2436 953.3814 964.5640 975.7136 981.1136 997.5358 1007.1222 1046.9906 1070.2130 1086.0054 1108.7706 1128.0838 1147.0364 1158.2462 1176.0547 1191.9617 1237.8606 1273.5357 1279.9438 1313.7585 1319.8432 1352.3764 1367.1779 1402.3695 1417.1664 1427.0882 1442.6605 1453.7305 1458.7808 1462.2925 1466.1603 1471.8474 1473.3172 1485.5458 1495.9062 1514.3956 1546.8515 1596.2323 1618.8406 2986.5495 2998.6578 3006.3288 3043.6496 3083.9443 3087.9943 3093.2503 3104.6603 3114.8357 3119.5459 3141.9333 3154.5034 3165.6687 3182.2916 3186.3797 3256.9285
redmass: 3.4415 4.0329 3.7687 2.9889 1.6863 2.2601 1.8166 1.6415 1.3346 2.6919 2.3063 2.9495 4.9799 4.2621 2.6203 3.6505 4.9125 3.1814 3.4582 4.3044 3.3443 6.6202 3.5086 4.9068 4.3016 6.4259 5.2941 3.9174 3.2291 1.2452 2.0966 2.9982 1.5598 1.8791 1.7407 4.7615 1.3865 7.0335 1.3756 2.6988 2.4234 1.4654 1.5038 2.9952 1.9244 1.2560 1.4662 2.0216 1.3314 1.5164 1.2291 2.3171 2.7806 2.5941 1.3487 1.6722 1.7804 2.6963 1.1974 1.2166 1.7931 1.6916 1.8709 1.1599 1.0457 1.4434 1.0501 1.0480 1.0843 1.1597 2.9384 6.0224 6.0915 6.1149 1.0321 1.0400 1.0372 1.0611 1.0969 1.1057 1.1013 1.0998 1.1019 1.0989 1.0905 1.1012 1.0879 1.0955 1.0961 1.0983
irintensity: 1.6426 0.3968 0.7064 0.9428 3.5356 1.5724 0.3039 3.3157 0.4820 0.2200 4.2642 0.5526 2.8270 6.9222 0.1301 2.2614 6.2846 5.3291 1.1289 8.1946 9.9237 1.4917 12.5525 13.5863 20.1750 1.8496 4.7767 0.8535 9.6470 41.1629 14.6505 5.2887 12.7240 17.2481 57.8622 14.6521 2.3654 58.9249 2.9459 2.9436 0.6152 2.9528 4.8073 2.9099 11.0144 0.0909 14.9818 14.9831 7.7775 24.1604 184.7117 15.4438 221.4851 70.8804 5.9463 44.8884 10.8089 50.3069 15.0098 30.8665 211.0441 58.2143 145.2877 55.1234 8.4376 6.9818 21.0297 20.1301 9.7326 36.6474 12.3226 9.8360 141.3294 345.7400 42.8742 4.2489 7.2811 8.7762 5.2665 26.2285 5.6762 14.2539 14.8888 4.3941 1.6026 9.0723 1.2947 0.2277 3.0846 19.8617
temp: 298.150 k
press: 1.00000 atm
elementType: 16 8 7 6 6 6 6 6 6 6 6 6 6 6 6 6 1 1 1 1 1 1 1 1 1 1 1 1 1 1 1 1
symmnumber: 1
zpe: 685198.2 jmol-1
zpe.correction: 0.260978 hartree
zpe.thermalcorrener: 0.277081 hartree
zpe.thermalcorrenthalpy: 0.278025 hartree
zpe.thermalcorrgfe: 0.217393 hartree
zpe.sumelectzpe: -1031.600549 hartree
zpe.sumelectthermal: -1031.584446 hartree
zpe.sumelectthermalent: -1031.583502 hartree
zpe.sumelectthermalfe: -1031.644134 hartree
dipole: 3.3888 3.0581 0.1981
dipole: 4.5690
quadrupole: -33.9772 -79.1016 -101.2057
quadrupole: -6.7328 4.1534 -0.8218
quadrupole: 37.4509 -7.6734 -29.7775 -6.7328 4.1534 -0.8218
hfenergy: -1031.861527 hartree
pointgroup: C01 [X(C13H16N1O1S1)]
dipole: 1.3193836 -1.2081508 0.1757219 debye
polarizability: 313.0425722|8.2473773|159.1225991|-6.996759|-19.2292721|93.9607468 unknown
InChI: InChI=1S/C13H16NOS/c1-4-14-10(2)9-16-13(14)11-5-7-12(15-3)8-6-11/h5-9H,4H2,1-3H3
charge 1 multiplicity 1
32 atoms
S  1.858853 2.209506 -0.115884
O  -4.567549 0.393446 -0.183484
N  2.076841 -0.390744 -0.19426
C  1.105672 0.58047 -0.144961
C  1.779884 -1.857073 -0.298127
C  3.422446 0.089171 -0.232318
C  -0.34147 0.445976 -0.14226
C  3.480676 1.461185 -0.205139
C  1.908276 -2.6087 1.04142
C  4.600687 -0.836601 -0.348144
C  -1.037805 -0.59622 0.544399
C  -1.124856 1.446976 -0.811359
C  -2.439653 -0.651956 0.558526
C  -2.518561 1.395321 -0.810234
C  -3.194305 0.343519 -0.125018
C  -5.361384 -0.648018 0.502201
H  0.765298 -1.955202 -0.715591
H  2.480742 -2.275786 -1.039292
H  4.366941 2.089261 -0.238475
H  2.939806 -2.597306 1.429336
H  1.622481 -3.663691 0.886815
H  1.253874 -2.188803 1.823852
H  4.592355 -1.397075 -1.301022
H  5.530882 -0.248369 -0.323061
H  4.646064 -1.565846 0.4783
H  -0.48964 -1.340031 1.127722
H  -0.626937 2.250389 -1.365988
H  -2.937129 -1.450524 1.115097
H  -3.116738 2.145831 -1.333872
H  -5.175981 -0.624965 1.591289
H  -5.135928 -1.647509 0.088337
H  -6.406147 -0.382733 0.293993
