program: Gaussian 09
title: 000209177
version: EM64L-G09RevD.01
frameworkgroup: C1[X(C20H28FN3O)]
method: RPBEPBE
basis: SDD
operation: Freq
keyword: #p
keyword: freq=noraman
keyword: PBEPBE/SDD
title: #p freq=noraman PBEPBE/SDD
converged: YES YES NO NO
title: Mulliken charges:
elementType: F O N N N C C C C C C C C C C C C C C C C C C C C H H H H H H H H H H H H H H H H H H H H H H H H H H H H
charge: -0.193266 -0.248247 -0.133424 -0.074391 -0.107776 -0.428942 -0.582614 -0.362098 0.580798 0.232512 -0.506678 -0.489494 0.211252 -0.613953 -0.619030 0.185871 -0.315793 -0.380428 -0.306466 -0.296538 -0.343165 -0.191469 -0.359187 -0.687923 -0.216786 0.231261 0.252684 0.210149 0.274305 0.206826 0.216453 0.291142 0.230910 0.190454 0.223088 0.226514 0.229898 0.187589 0.225260 0.186312 0.214387 0.253001 0.233716 0.214323 0.201798 0.237031 0.184362 0.229019 0.202450 0.219514 0.213403 0.233576 0.227810
chargesum: 0.00000
title: Mulliken charges with hydrogens summed into heavy atoms:
elementType: F O N N N C C C C C C C C C C C C C C C C C C C C
charge: -0.193266 -0.248247 -0.133424 -0.074391 -0.107776 0.055003 -0.098160 0.061181 0.580798 0.232512 -0.215537 -0.258584 0.211252 0.026104 0.023717 0.185871 -0.062792 0.020271 -0.072750 0.119582 0.078228 0.037550 -0.125611 -0.052556 0.011024
polarizability: 3.07834487e+02 2.95851549e+01 2.72535448e+02 -6.65274316e+00 -1.32878060e+01 1.77622411e+02
1716.lowfreq: -30.5867 -10.7209 -2.9667 -0.0003 -0.0001 0.0009 0.8401 9.7908 16.8184
frequency: -28.5773 -1.7986 16.5687 19.4267 35.1706 41.2765 47.0074 55.1460 59.9236 93.3172 107.8896 116.3559 126.2792 158.1934 159.9469 186.0858 211.4125 214.3083 223.2245 229.4585 239.4380 262.1250 266.2070 291.4087 313.9218 316.9291 341.4463 359.9797 376.2453 413.4911 420.5882 435.8978 446.5271 449.0615 490.6759 514.7213 532.5953 541.9826 567.5759 584.0590 617.4193 646.6123 707.3083 722.7902 729.2691 735.5027 762.6514 764.9266 768.6056 789.8969 806.6951 824.3626 840.0303 846.5788 857.9607 882.8611 921.2445 935.7121 943.3092 944.7689 945.5374 954.9134 967.1941 975.2369 997.4267 1014.8687 1032.4171 1033.1283 1039.8544 1056.5860 1073.3186 1082.2217 1090.0904 1090.7143 1099.9116 1124.8909 1136.8683 1139.2097 1151.4712 1154.7530 1170.8652 1203.2244 1209.0905 1218.4806 1241.4644 1244.9115 1252.2570 1255.0954 1264.4576 1276.6152 1291.4270 1296.7772 1310.2028 1311.6487 1323.7870 1335.4057 1353.7802 1365.0378 1370.3447 1377.3656 1383.5764 1389.8169 1396.3600 1418.4156 1425.9414 1428.2964 1441.6207 1450.3008 1453.6320 1460.9488 1463.4106 1473.0673 1473.8228 1474.7600 1476.1162 1478.6539 1481.7738 1485.7992 1485.8621 1498.4803 1503.7649 1549.2119 1579.3194 1597.8777 1626.4574 2843.4540 2846.9044 2866.3284 2947.6211 2971.2160 2974.6857 2979.2572 2984.6355 3000.6416 3010.3044 3019.4239 3020.9128 3030.4204 3031.4996 3048.8931 3063.1610 3066.5460 3073.3471 3074.8082 3078.0067 3086.5540 3120.6632 3125.3199 3134.5303 3160.9285 3165.9047 3167.0710 3177.4362
redmass: 2.8472 4.2097 4.9983 4.1856 4.3357 3.8384 3.9579 1.8509 3.6196 3.9723 2.3778 4.3555 4.3462 4.0979 4.9224 3.7594 3.2623 1.6043 1.1776 1.3187 1.8491 2.3965 3.0227 3.1454 3.9326 3.1463 2.8333 5.2042 2.2131 3.4200 2.8516 2.3827 3.6904 3.5764 4.4131 2.9672 4.0686 4.6328 4.1239 4.8839 6.8336 4.7312 3.8989 1.7626 1.9686 3.0593 3.9061 1.8206 2.5487 1.2163 1.5156 4.1932 1.8897 1.3579 1.7964 1.5270 1.9137 1.7920 1.5146 2.4279 5.3796 2.8701 1.2643 1.3216 2.3706 2.7841 3.2180 1.6037 2.3523 2.4380 2.1344 1.6279 1.6284 1.4798 2.8330 1.9947 1.5939 1.7914 1.7432 1.6544 1.0995 2.1467 1.9898 1.2768 1.5209 1.3245 1.5209 3.5055 2.5607 1.6390 1.1285 1.2131 1.2694 1.7539 1.3902 3.7572 1.4588 1.6110 1.4420 1.3446 2.5342 1.2181 2.3561 1.1532 2.3118 3.1938 1.1609 1.0827 1.1703 1.0583 1.1149 1.1290 1.1639 1.0553 1.0934 1.0459 1.2391 1.2290 1.0960 1.5814 2.1198 5.4283 7.3830 5.9630 7.3433 1.0634 1.0617 1.0593 1.0552 1.0381 1.0619 1.0644 1.0648 1.0619 1.1049 1.0732 1.0850 1.0721 1.0946 1.1009 1.1021 1.0978 1.1011 1.0991 1.1010 1.1005 1.0893 1.0894 1.0887 1.0927 1.0926 1.0936 1.1000
irintensity: 0.7484 0.5693 0.5538 0.1942 0.0956 0.7184 0.0783 0.1156 0.7098 1.7921 1.0833 3.0967 1.0885 1.3126 1.3325 1.9496 0.3251 0.2425 0.7334 0.4233 0.7069 1.2694 0.2948 0.2549 3.1372 2.8368 17.7212 0.1783 5.4057 4.0070 7.2582 0.2577 4.2737 1.2174 13.5446 5.0687 5.5209 0.3176 0.8853 10.4897 3.4126 11.7989 3.0379 11.9284 35.0794 1.4075 5.2153 35.9859 43.2169 17.7549 27.4758 18.7216 5.4280 0.2568 14.8138 13.9912 19.5937 15.7489 2.0345 26.1988 10.1094 56.5259 10.3282 0.2291 22.2480 27.7334 19.8191 22.4458 10.5337 26.1746 12.4132 9.1998 4.2628 8.5892 116.1919 7.1254 15.8414 2.8617 23.6936 4.9469 5.6511 18.5846 46.8275 2.0485 90.9225 16.0802 8.6773 273.7414 5.0605 4.5838 4.6584 12.6362 5.4641 10.5272 8.4416 32.6356 23.0602 1.8910 8.3556 4.1458 28.2831 9.9739 41.4304 4.4993 27.8213 18.6147 0.7760 9.7739 43.1714 9.6705 17.5404 45.2478 61.4434 1.6913 59.5570 11.3601 47.8113 33.6593 18.6982 84.5318 177.9462 35.2236 4.0820 354.0828 11.5678 59.9133 76.5039 209.8406 31.9927 42.3017 15.5791 49.5758 53.6288 19.1036 43.4870 40.0238 29.7819 40.4108 19.9546 6.6111 27.8330 5.4122 88.3715 49.2839 33.7310 50.7726 27.8249 16.2653 11.5866 0.9549 31.6351 15.5281 16.3449
temp: 298.150 k
press: 1.00000 atm
elementType: 9 8 7 7 7 6 6 6 6 6 6 6 6 6 6 6 6 6 6 6 6 6 6 6 6 1 1 1 1 1 1 1 1 1 1 1 1 1 1 1 1 1 1 1 1 1 1 1 1 1 1 1 1
symmnumber: 1
zpe: 1167046.8 jmol-1
zpe.correction: 0.444505 hartree
zpe.thermalcorrener: 0.469099 hartree
zpe.thermalcorrenthalpy: 0.470043 hartree
zpe.thermalcorrgfe: 0.387528 hartree
zpe.sumelectzpe: -1116.311047 hartree
zpe.sumelectthermal: -1116.286452 hartree
zpe.sumelectthermalent: -1116.285508 hartree
zpe.sumelectthermalfe: -1116.368023 hartree
dipole: -1.6402 4.2030 -0.2893
dipole: 4.5210
quadrupole: -128.9639 -144.0707 -149.3175
quadrupole: 7.5240 -9.3592 -2.4927
quadrupole: 11.8201 -3.2867 -8.5334 7.5240 -9.3592 -2.4927
hfenergy: -1116.7555513 hartree
pointgroup: C01 [X(C20H28F1N3O1)]
dipole: -0.7861333 -1.5953382 0.0256293 debye
polarizability: 302.5060368|-32.7150571|279.4008559|-1.4188303|-5.2044009|176.0854539 unknown
InChI: InChI=1S/C20H28FN3O/c1-4-5-14-25-19-10-9-17(15-18(19)21)16-24(13-12-23(2)3)20-8-6-7-11-22-20/h6-11,15H,4-5,12-14,16H2,1-3H3
charge 0 multiplicity 1
53 atoms
F  2.715159 1.779056 -0.94856
O  4.055499 -0.557443 -0.626985
N  -2.2953 0.345106 0.415845
N  -4.178803 -2.816592 -0.605486
N  -2.289635 2.644685 0.945161
C  -2.67346 -0.810619 -0.412513
C  -1.285965 0.114803 1.477284
C  -3.914896 -1.562339 0.135034
C  0.123743 -0.102111 0.938546
C  -2.828924 1.615444 0.205583
C  0.781668 0.94244 0.233834
C  0.806515 -1.324517 1.124855
C  2.774499 -0.487267 -0.080536
C  -5.055136 -3.737441 0.149095
C  -4.682797 -2.588922 -1.976352
C  2.07215 0.736987 -0.256283
C  2.116303 -1.522025 0.625852
C  6.16108 -1.634074 -1.133282
C  -3.886138 1.856016 -0.735197
C  4.805639 -1.819297 -0.448531
C  7.038845 -0.541334 -0.482524
C  -4.35312 3.169624 -0.908139
C  -2.775076 3.902604 0.767034
C  8.394073 -0.372049 -1.201075
C  -3.796721 4.230285 -0.148749
H  -2.834464 -0.48076 -1.454885
H  -1.825233 -1.518188 -0.434544
H  -1.592605 -0.77011 2.069784
H  -1.312596 1.002666 2.131172
H  -4.801185 -0.876246 0.136789
H  -3.714736 -1.825701 1.191064
H  0.287346 1.907026 0.080078
H  0.314916 -2.139987 1.669012
H  -6.086796 -3.335111 0.31602
H  -5.147893 -4.692625 -0.398545
H  -4.608268 -3.952288 1.13601
H  -3.954494 -2.007873 -2.56702
H  -5.66314 -2.045921 -1.997681
H  -4.82073 -3.560702 -2.482611
H  6.69242 -2.607852 -1.106364
H  5.989957 -1.389672 -2.199685
H  2.615112 -2.48173 0.787203
H  -4.339305 1.037977 -1.300767
H  4.233497 -2.651759 -0.908004
H  4.928867 -2.021591 0.636588
H  6.482666 0.414042 -0.492391
H  7.210999 -0.797961 0.583174
H  -5.157684 3.365805 -1.625938
H  8.977765 -1.312467 -1.185764
H  9.006499 0.413261 -0.721923
H  8.246909 -0.084941 -2.259299
H  -2.309014 4.676764 1.388793
H  -4.141013 5.262022 -0.259178
