program: Gaussian 09
title: 000016607
version: EM64L-G09RevD.01
frameworkgroup: C1[X(C14H22)]
method: RPBEPBE
basis: SDD
operation: Freq
keyword: #p
keyword: freq=noraman
keyword: PBEPBE/SDD
title: #p freq=noraman PBEPBE/SDD
converged: YES YES NO NO
title: Mulliken charges:
elementType: C C C C C C C C C C C C C C H H H H H H H H H H H H H H H H H H H H H H
charge: -0.384952 -0.362541 -0.371165 -0.389937 -0.353346 -0.565811 -0.356192 0.504942 -0.696483 -0.415134 -0.415938 -0.229789 -0.229413 -0.244967 0.194339 0.193455 0.190972 0.192327 0.189018 0.189750 0.210220 0.210330 0.187882 0.188306 0.205342 0.204377 0.194622 0.194815 0.209762 0.215042 0.209831 0.230447 0.230596 0.221767 0.221710 0.225819
chargesum: 0.00000
title: Mulliken charges with hydrogens summed into heavy atoms:
elementType: C C C C C C C C C C C C C C
charge: 0.002841 0.020758 0.007603 0.030612 0.022842 -0.156092 0.033245 0.504942 -0.061849 -0.184687 -0.185342 -0.008022 -0.007703 -0.019149
polarizability: 1.96916634e+02 -1.80540204e+00 1.37507816e+02 1.89714108e+01 2.21061824e+00 1.12002837e+02
1716.lowfreq: -14.1934 -9.9779 -3.7735 -0.0004 0.0004 0.0005 17.3086 31.9663 39.4882
frequency: 5.0147 31.0851 37.6654 49.4325 86.4130 91.6915 100.7786 139.2076 145.4405 171.2363 197.8625 235.2419 289.6819 335.1615 335.9613 403.0519 424.5094 459.7678 515.1774 584.4742 617.5810 704.9046 720.4943 727.5871 747.3455 758.8669 787.4986 809.1021 850.8035 855.7946 888.8471 914.3359 929.4828 974.6166 984.6047 989.6671 992.3307 1002.5603 1012.1521 1026.6167 1041.4590 1056.5263 1058.0516 1078.1744 1080.8418 1109.2636 1119.4908 1170.8423 1185.5660 1185.7398 1214.6440 1216.9118 1221.4045 1256.7524 1257.8175 1279.9856 1282.4645 1292.9110 1294.2413 1295.9014 1324.7760 1326.8135 1343.8394 1354.8063 1355.3544 1382.0628 1389.3643 1439.5675 1461.1938 1461.6573 1465.5541 1468.2720 1474.6449 1477.9282 1481.2141 1483.0141 1487.1409 1489.4955 1592.3935 1613.8168 2948.4453 2949.9033 2952.3592 2959.2604 2966.8291 2968.2866 2971.1561 2977.8863 2982.6808 2989.0447 3000.4373 3012.8995 3023.0359 3036.0138 3047.8114 3067.5302 3069.8769 3112.7093 3113.1393 3129.7942 3141.2088 3160.4851
redmass: 3.6372 2.3024 3.0210 2.6411 2.1679 2.8587 2.2428 1.8520 2.1158 3.6638 4.3308 1.1097 3.2428 2.8058 2.7972 2.8159 3.2557 3.0093 3.1955 4.2699 6.3554 1.7289 1.0615 1.0793 1.1165 1.9609 1.1863 3.8629 1.2433 1.2431 1.8832 1.4748 1.2412 1.3877 3.8619 6.2051 1.3843 1.1824 4.1656 2.1855 3.1590 1.4125 2.9394 2.3438 2.1952 1.3005 2.6019 1.0525 1.1791 1.6343 1.2874 2.3875 1.4571 1.3325 1.3031 1.0964 1.0992 1.0919 1.3306 1.1335 1.3969 1.2551 1.4816 1.5966 1.6829 7.7825 1.2178 2.1759 1.0746 1.0741 1.0712 1.0889 1.0903 1.0424 1.1138 2.1591 1.0892 1.0968 6.0361 6.1853 1.0589 1.0589 1.0592 1.0591 1.0589 1.0588 1.0365 1.0591 1.0966 1.0987 1.1012 1.1023 1.1041 1.1047 1.1047 1.1007 1.0993 1.0864 1.0872 1.0907 1.0958 1.1015
irintensity: 0.0014 0.0050 0.0131 0.0166 0.0468 0.0776 0.0121 0.0023 0.0140 0.2561 0.7262 0.0006 0.2504 0.1049 0.1037 0.0003 0.3717 1.6327 11.8078 5.6671 0.0754 53.0590 13.9970 0.0008 3.1219 44.6919 0.3876 3.2907 0.2351 0.2925 4.8923 2.2353 0.7973 0.0269 0.5631 0.0162 0.2396 0.0013 0.2464 8.5718 0.3138 4.9857 0.1593 0.3967 0.1989 6.0337 18.2214 0.0848 0.2558 0.4297 12.7888 1.7525 0.0788 0.5462 0.1689 0.0078 0.6724 0.0100 0.7327 0.1149 1.3267 0.1432 0.1177 0.7621 0.5423 0.1499 11.1003 6.3817 0.0398 0.0213 0.0085 0.6776 0.7129 12.3143 3.0064 18.3980 1.4814 34.3743 1.3637 12.8011 2.3126 2.3416 0.0690 29.2158 60.8975 65.6650 38.3551 103.7595 0.3279 0.6926 0.8291 0.1905 0.7087 57.7401 137.7248 97.4404 56.0472 10.8334 7.3762 11.3687 49.8224 25.3266
temp: 298.150 k
press: 1.00000 atm
elementType: 6 6 6 6 6 6 6 6 6 6 6 6 6 6 1 1 1 1 1 1 1 1 1 1 1 1 1 1 1 1 1 1 1 1 1 1
symmnumber: 1
zpe: 843886.1 jmol-1
zpe.correction: 0.321419 hartree
zpe.thermalcorrener: 0.337278 hartree
zpe.thermalcorrenthalpy: 0.338222 hartree
zpe.thermalcorrgfe: 0.273961 hartree
zpe.sumelectzpe: -545.599091 hartree
zpe.sumelectthermal: -545.583232 hartree
zpe.sumelectthermalent: -545.582288 hartree
zpe.sumelectthermalfe: -545.646550 hartree
dipole: 0.5658 -0.0171 0.1071
dipole: 0.5761
quadrupole: -89.3655 -82.3203 -90.6783
quadrupole: -0.3392 3.7038 0.7717
quadrupole: -1.9108 5.1344 -3.2236 -0.3392 3.7038 0.7717
hfenergy: -545.9205102 hartree
pointgroup: C01 [X(C14H22)]
dipole: 0.2227346 0.0002231 -0.0418843 debye
polarizability: 197.0481659|-1.0500671|137.6048238|-18.7314944|-1.5513556|111.774298 unknown
InChI: InChI=1S/C14H22/c1-2-3-4-5-6-8-11-14-12-9-7-10-13-14/h7,9-10,12-13H,2-6,8,11H2,1H3
charge 0 multiplicity 1
36 atoms
C  2.315185 0.035032 0.196475
C  1.141581 -0.011232 -0.80779
C  3.702161 -0.017536 -0.483262
C  -0.245017 0.026528 -0.128617
C  4.878888 0.022216 0.517494
C  -1.417313 -0.029941 -1.148129
C  6.264698 -0.037133 -0.164951
C  -2.781907 -0.014025 -0.475619
C  7.435599 -0.000788 0.840823
C  -3.408876 -1.223113 -0.076034
C  -3.442067 1.210319 -0.193231
C  -4.657034 -1.211942 0.586803
C  -4.690337 1.228211 0.469518
C  -5.303026 0.015646 0.862843
H  2.240033 0.959321 0.806707
H  2.223236 -0.813281 0.906671
H  1.222707 -0.932253 -1.423026
H  1.228477 0.841279 -1.514101
H  3.774316 -0.941077 -1.095558
H  3.795141 0.83201 -1.192181
H  -0.338536 -0.823708 0.57703
H  -0.339488 0.947845 0.481149
H  4.785873 -0.82558 1.228483
H  4.81171 0.947115 1.128154
H  -1.324092 0.829745 -1.841107
H  -1.306541 -0.94745 -1.759649
H  6.329571 -0.96059 -0.776232
H  6.357634 0.810968 -0.873966
H  7.382496 -0.855573 1.541569
H  8.413918 -0.045218 0.327591
H  7.411887 0.926898 1.443564
H  -2.915917 -2.179627 -0.292237
H  -2.975642 2.155003 -0.500919
H  -5.127178 -2.156868 0.883049
H  -5.186534 2.183946 0.67469
H  -6.272605 0.027053 1.373495
