program: Gaussian 09
title: 000209162
version: EM64L-G09RevD.01
frameworkgroup: C1[X(C15H23N3O4)]
method: RPBEPBE
basis: SDD
operation: Freq
keyword: #p
keyword: freq=noraman
keyword: PBEPBE/SDD
title: #p freq=noraman PBEPBE/SDD
converged: YES YES NO NO
title: Mulliken charges:
elementType: O O O O N N N C C C C C C C C C C C C C C C H H H H H H H H H H H H H H H H H H H H H H H
charge: -0.286335 -0.287683 -0.288328 -0.288398 -0.143613 -0.617453 -0.616996 -0.447240 -0.450561 -0.372260 -0.375303 0.452289 -0.298280 -0.299175 -0.551586 -0.388562 0.459511 -0.234254 -0.432317 -0.821616 0.294751 0.295526 0.220956 0.221306 0.228865 0.225437 0.241627 0.232932 0.262829 0.211872 0.228352 0.221441 0.224228 0.229539 0.244092 0.221603 0.213269 0.228349 0.237469 0.229877 0.218638 0.340228 0.337527 0.340544 0.336905
chargesum: 0.00000
title: Mulliken charges with hydrogens summed into heavy atoms:
elementType: O O O O N N N C C C C C C C C C C C C C C C
charge: -0.286335 -0.287683 -0.288328 -0.288398 -0.143613 0.060301 0.060453 -0.004979 0.003742 0.102299 0.099398 0.452289 0.151513 0.154592 -0.307494 -0.166959 0.459511 -0.020985 -0.203968 -0.135633 0.294751 0.295526
polarizability: 2.36051357e+02 -1.37713873e+01 2.25500749e+02 -7.53956943e+00 1.98607429e-01 1.39780980e+02
1716.lowfreq: -3.7340 -2.2232 -0.0007 -0.0006 0.0002 3.4459 9.6990 14.9865 20.2024
frequency: 5.2822 14.5998 20.1960 32.3027 36.8009 42.8907 59.7735 60.8072 64.1633 67.2446 80.7365 128.8969 139.8686 174.6114 180.8307 213.6070 216.1883 233.4734 235.9084 280.3558 281.9070 310.0987 359.4736 381.2879 405.1391 423.4851 448.0798 482.1861 489.4109 495.8807 496.1278 515.4427 520.2499 521.3528 555.4052 564.8474 583.6452 622.9380 626.4246 694.4109 703.8929 704.6371 705.9809 760.6486 765.1581 769.1687 787.2952 794.3776 846.5392 862.2900 864.9059 871.1599 874.4455 957.0998 968.9535 983.2133 1000.7889 1008.5309 1021.1507 1024.3276 1037.1942 1046.0918 1055.7385 1057.1573 1067.6898 1068.0475 1097.4784 1101.5931 1150.6155 1186.9290 1189.0067 1192.8419 1233.4341 1237.0862 1275.1451 1277.3249 1289.1431 1293.1849 1296.9568 1304.5086 1307.8957 1310.2577 1326.8635 1364.9076 1371.3915 1379.1784 1385.4152 1387.0009 1391.5839 1396.6369 1444.5018 1456.8726 1457.9403 1469.7817 1476.0775 1477.6167 1479.6831 1489.9050 1496.2492 1509.1890 1586.1640 1587.4756 1587.5747 1620.3645 1684.2455 1685.2775 2972.3990 2972.8879 2979.0320 3005.4427 3006.5265 3015.1838 3015.9248 3023.0864 3028.9069 3053.6289 3065.7573 3067.4514 3083.1321 3094.5981 3096.9971 3117.0344 3139.3561 3142.3894 3160.0876 3558.6493 3558.8625 3716.9586 3717.1679
redmass: 6.1169 5.5286 5.2448 6.5274 4.5548 4.4322 4.3932 5.0119 1.0967 4.2397 5.1319 2.1964 2.3113 5.0012 4.2222 3.9700 3.1245 3.6812 3.5539 2.9993 3.0492 4.0790 3.0008 3.1706 2.8449 3.2949 2.9085 3.4434 3.4227 1.1721 1.1812 4.6477 1.0780 1.0699 3.4624 3.4274 4.1481 5.0538 5.0343 1.8437 7.9803 11.2842 6.3238 1.2425 1.2271 1.6221 2.9260 2.5908 1.3151 1.4492 1.3980 1.9319 2.2454 1.3269 3.2056 2.7065 5.5916 3.3966 4.3198 4.3973 2.6276 1.5495 2.0458 2.0284 3.6528 3.7782 1.8564 1.6274 1.8546 1.8301 1.1438 1.4998 1.7446 1.8295 1.2447 1.2633 1.2895 1.1259 1.1522 1.2057 2.7545 2.6429 1.3509 1.2947 1.4201 5.1562 1.4821 1.4673 1.7274 1.2597 2.1180 1.0993 1.0985 1.1202 1.0609 1.2065 1.2147 1.1174 1.7273 1.3146 5.0391 1.2185 1.2556 5.9814 6.8682 6.9789 1.0385 1.0591 1.0600 1.0624 1.0600 1.0597 1.0598 1.0991 1.1009 1.0950 1.1033 1.1026 1.1000 1.1075 1.1069 1.0855 1.0924 1.0909 1.0961 1.0445 1.0445 1.1058 1.1058
irintensity: 0.7643 0.6150 0.2632 1.8281 3.3198 3.2200 2.9867 3.8264 0.5532 2.2899 8.1422 0.3987 0.6942 3.9093 2.5366 0.0683 3.1855 5.2757 1.0309 24.6926 9.8889 3.1149 8.4354 5.8404 4.6918 29.6569 2.2749 1.6130 16.1833 149.6807 420.0963 6.4194 33.9077 38.8618 1.3468 0.9803 5.6320 0.8393 3.2218 23.1315 16.6683 54.0967 3.9280 11.6852 18.1173 59.0700 5.5372 9.7407 5.8376 10.7458 7.2877 11.2900 5.8608 0.2549 0.7955 18.3705 152.8279 56.0680 10.7996 131.4979 17.6729 18.7108 4.7007 14.1102 54.5323 39.2307 7.0594 5.6457 6.7140 38.7886 7.8927 44.7668 16.4306 12.5257 10.0753 0.5352 35.3804 11.9071 25.2236 7.4955 673.6459 90.5535 5.8145 46.5845 78.2911 9.9782 12.9440 21.9326 9.8542 11.6745 18.7831 16.1729 17.5177 1.1475 10.4308 5.9737 3.3434 38.7102 70.1418 60.4318 39.9576 166.9767 13.3108 225.2481 346.4404 406.9742 40.1983 42.8251 24.7049 3.2603 1.3867 53.2762 46.7855 25.9708 16.1113 23.6382 5.0688 8.2278 19.5368 27.7456 35.8771 6.5749 44.8031 11.6493 23.1025 95.4261 46.3049 48.2756 50.2847
temp: 298.150 k
press: 1.00000 atm
elementType: 8 8 8 8 7 7 7 6 6 6 6 6 6 6 6 6 6 6 6 6 6 6 1 1 1 1 1 1 1 1 1 1 1 1 1 1 1 1 1 1 1 1 1 1 1
symmnumber: 1
zpe: 978064.2 jmol-1
zpe.correction: 0.372525 hartree
zpe.thermalcorrener: 0.396544 hartree
zpe.thermalcorrenthalpy: 0.397488 hartree
zpe.thermalcorrgfe: 0.312374 hartree
zpe.sumelectzpe: -1048.885703 hartree
zpe.sumelectthermal: -1048.861684 hartree
zpe.sumelectthermalent: -1048.860740 hartree
zpe.sumelectthermalfe: -1048.945854 hartree
dipole: 1.3622 -1.7188 -1.0822
dipole: 2.4457
quadrupole: -93.3026 -132.2513 -127.9284
quadrupole: 16.5233 14.0138 2.9516
quadrupole: 24.5248 -14.4239 -10.1009 16.5233 14.0138 2.9516
hfenergy: -1049.2582276 hartree
pointgroup: C01 [X(C15H23N3O4)]
dipole: -0.424124 -0.7754831 0.3802165 debye
polarizability: 231.4692824|14.9995287|230.289311|-4.533429|3.1076135|139.5744929 unknown
InChI: InChI=1S/C15H23N3O4/c1-12-5-2-6-13(11-12)18(7-3-9-21-14(16)19)8-4-10-22-15(17)20/h2,5-6,11H,3-4,7-10,16-17H2,1H3
charge 0 multiplicity 1
45 atoms
O  -5.087737 -1.110337 0.097336
O  4.053361 -2.42276 0.140191
O  -4.346258 -3.143635 -0.852121
O  4.941316 -0.392939 -0.684068
N  -0.236159 0.175759 0.252357
N  -6.363736 -2.120895 -1.487246
N  6.162398 -1.816014 0.730859
C  -1.384447 -0.398338 0.969098
C  0.620523 -0.759339 -0.493203
C  -2.689523 -0.423741 0.126852
C  1.883159 -1.203842 0.294284
C  0.014951 1.56154 0.246326
C  -3.844215 -1.062525 0.909684
C  2.778054 -2.113712 -0.558474
C  1.196215 2.096193 -0.359222
C  -0.895153 2.484959 0.850255
C  1.463729 3.483773 -0.378084
C  -0.618729 3.866494 0.8414
C  0.548287 4.378362 0.233715
C  2.719614 4.00495 -1.05932
C  -5.192644 -2.217727 -0.768511
C  5.0547 -1.439174 0.004115
H  -1.549318 0.154343 1.914352
H  -1.126356 -1.435961 1.259089
H  0.925964 -0.299125 -1.453608
H  0.014768 -1.648886 -0.754428
H  -2.959725 0.603742 -0.176682
H  -2.510453 -1.009086 -0.793928
H  2.455944 -0.307647 0.590238
H  1.580944 -1.727085 1.22092
H  -3.587137 -2.091685 1.222923
H  -4.130152 -0.461175 1.789412
H  2.325538 -3.104625 -0.730715
H  3.015213 -1.633223 -1.525992
H  1.937904 1.429053 -0.810153
H  -1.820861 2.135943 1.317124
H  -1.332516 4.55239 1.313526
H  0.749772 5.455631 0.234309
H  3.515652 3.240026 -1.083679
H  2.509917 4.297924 -2.106837
H  3.115796 4.897865 -0.543417
H  -6.589075 -2.853439 -2.153814
H  -6.988501 -1.330189 -1.350249
H  6.977355 -1.209731 0.727218
H  6.161327 -2.685314 1.258665
