program: Gaussian 09
title: 000209159
version: EM64L-G09RevD.01
frameworkgroup: C1[X(C12H17NO3)]
method: RPBEPBE
basis: SDD
operation: Freq
keyword: #p
keyword: freq=noraman
keyword: PBEPBE/SDD
title: #p freq=noraman PBEPBE/SDD
converged: YES YES NO NO
title: Mulliken charges:
elementType: O O O N C C C C C C C C C C C C H H H H H H H H H H H H H H H H H
charge: -0.399361 -0.289151 -0.438016 -0.136543 -0.330290 -0.397811 0.252214 0.120986 -0.672353 -0.654857 0.038637 -0.315540 0.210249 -0.263514 -0.339820 -0.520208 0.257667 0.202650 0.265207 0.228149 0.203304 0.263500 0.220306 0.218594 0.226668 0.224596 0.239600 0.228268 0.254353 0.392217 0.206959 0.277335 0.226004
chargesum: 0.00000
title: Mulliken charges with hydrogens summed into heavy atoms:
elementType: O O O N C C C C C C C C C C C C
charge: -0.399361 -0.289151 -0.045799 -0.136543 0.130027 0.095545 0.252214 0.120986 0.014756 0.015002 0.038637 -0.075939 0.210249 -0.035245 -0.085467 0.190090
polarizability: 2.13180491e+02 3.17482262e+00 1.65042280e+02 -3.34159943e+00 2.12461923e+00 8.94172450e+01
1716.lowfreq: -7.0042 -2.2557 -0.0008 -0.0007 0.0005 8.3975 42.3328 51.8667 74.2120
frequency: 42.2265 51.8124 74.2037 91.8645 112.9901 125.0939 141.7126 156.9134 175.9425 187.4523 216.4369 217.8048 250.8199 294.4674 314.8960 325.5510 351.8334 370.1187 435.9649 454.8813 475.8465 483.2577 527.3341 572.0586 584.5967 605.5488 655.8295 697.0987 741.9626 757.1634 778.6321 789.0502 799.9030 826.0064 895.8664 899.6837 940.9266 956.2766 973.3658 981.5728 1023.8808 1069.3694 1076.2910 1081.6258 1099.9282 1114.1024 1119.8498 1157.3469 1174.0743 1193.9124 1210.4242 1224.9942 1262.1928 1284.5365 1297.5813 1333.7561 1347.3197 1358.2041 1368.8723 1386.8456 1392.5832 1416.5254 1433.1482 1433.9398 1449.9908 1455.2950 1465.9163 1467.4436 1470.8467 1483.2279 1486.0160 1486.5650 1496.7669 1551.0036 1590.2260 1623.3081 2598.6412 2976.7966 2985.8542 2988.3929 2988.8261 3016.4366 3073.4460 3073.8084 3088.0881 3090.1883 3093.4337 3096.4198 3112.3090 3134.9511 3143.5431 3166.6500 3186.6978
redmass: 3.7087 3.8420 1.9395 3.2543 3.0026 2.9045 3.8696 1.9255 1.4798 1.5127 2.3206 1.6420 3.2242 5.3985 3.0718 3.1548 2.7410 4.7449 5.8806 4.3835 4.2868 4.0175 4.0351 4.5531 5.2296 5.2531 4.8263 7.0046 1.8660 2.7461 1.4911 1.7416 1.5234 4.5579 2.8820 1.4060 2.1256 1.3377 1.2628 2.7634 2.9976 2.1834 1.8922 1.8676 1.7760 1.2397 2.0882 1.3636 1.2406 3.0409 3.3582 2.2495 2.7560 1.4389 1.3213 2.6295 1.2470 1.5319 2.9994 1.2638 1.2162 1.9039 1.8981 1.9074 1.2723 1.0967 1.3712 1.1227 1.0505 1.0534 1.0959 1.1440 1.1791 3.5775 4.5999 3.3628 1.0722 1.0362 1.0664 1.0368 1.0384 1.0633 1.0989 1.0958 1.0985 1.0948 1.0984 1.0989 1.1017 1.1055 1.0868 1.0937 1.0949
irintensity: 0.9575 0.7868 7.3671 0.7408 1.3288 0.3680 1.3137 2.4193 3.4101 0.4317 2.7293 0.7880 1.8822 0.0736 0.8696 4.3976 0.7309 9.8012 6.6135 24.4895 9.7062 10.1005 7.5835 0.3777 7.0354 10.5731 8.0300 0.7001 51.5570 6.3807 3.4838 41.7373 14.3250 38.2490 6.9838 4.5892 11.0206 5.8101 91.7317 73.2488 25.3140 19.4779 1.8926 25.5072 26.2419 12.0963 23.2790 3.9828 7.2269 7.3100 35.0271 53.8391 136.3668 275.0432 80.2722 127.2214 2.0572 4.2298 71.6157 16.4603 27.5590 65.9884 395.2415 64.5783 18.9491 20.4581 17.2011 15.3478 22.1481 23.2936 15.0490 34.3792 49.5219 49.2573 20.4714 36.5553 630.8833 90.4643 21.5031 19.9869 44.5030 40.0990 15.5956 12.4588 38.6387 41.0226 33.5517 23.3444 24.0975 11.0113 7.0064 8.8893 9.7924
temp: 298.150 k
press: 1.00000 atm
elementType: 8 8 8 7 6 6 6 6 6 6 6 6 6 6 6 6 1 1 1 1 1 1 1 1 1 1 1 1 1 1 1 1 1
symmnumber: 1
zpe: 712001.5 jmol-1
zpe.correction: 0.271187 hartree
zpe.thermalcorrener: 0.287768 hartree
zpe.thermalcorrenthalpy: 0.288713 hartree
zpe.thermalcorrgfe: 0.227174 hartree
zpe.sumelectzpe: -746.674231 hartree
zpe.sumelectthermal: -746.657650 hartree
zpe.sumelectthermalent: -746.656706 hartree
zpe.sumelectthermalfe: -746.718244 hartree
dipole: 4.2841 2.1749 2.4130
dipole: 5.3765
quadrupole: -86.3055 -92.3046 -98.0775
quadrupole: 3.4359 -3.0600 -2.4503
quadrupole: 5.9237 -0.0754 -5.8483 3.4359 -3.0600 -2.4503
hfenergy: -746.9454184 hartree
pointgroup: C01 [X(C12H17N1O3)]
dipole: -1.4641733 -0.8108225 1.2934929 debye
polarizability: 210.733807|10.031548|160.618624|-5.2385395|-22.3306056|96.287585 unknown
InChI: InChI=1S/C12H17NO3/c1-4-13(5-2)12(15)9-7-6-8-10(16-3)11(9)14/h6-8,14H,4-5H2,1-3H3
charge 0 multiplicity 1
33 atoms
O  -1.149572 1.377878 -0.985673
O  3.918466 0.935364 -0.167822
O  1.265244 1.886876 -0.770831
N  -2.199475 -0.187381 0.338391
C  -3.483475 0.450462 -0.072429
C  -2.280392 -1.084715 1.517555
C  -1.042106 0.323176 -0.218949
C  0.315565 -0.245533 0.024735
C  -3.811125 1.7215 0.739775
C  -2.844394 -2.486679 1.202001
C  1.43616 0.629467 -0.229005
C  0.569843 -1.600329 0.386367
C  2.764913 0.171027 0.049194
C  1.883133 -2.058271 0.582676
C  2.971476 -1.164664 0.445883
C  3.920299 2.359558 0.230842
H  -3.404244 0.708387 -1.14058
H  -4.280137 -0.306448 0.046682
H  -1.28442 -1.158198 1.980794
H  -2.939439 -0.590512 2.259185
H  -3.874264 1.512845 1.823702
H  -3.037278 2.487199 0.568367
H  -4.785175 2.132757 0.417932
H  -3.865459 -2.427196 0.784755
H  -2.216349 -3.025635 0.47138
H  -2.894089 -3.088577 2.127698
H  -0.256034 -2.310328 0.464415
H  2.067129 -3.105151 0.8434
H  4.003312 -1.49019 0.611209
H  0.253566 1.936872 -1.045042
H  3.72502 2.453369 1.316898
H  3.167518 2.928207 -0.335509
H  4.93918 2.708065 0.003004
