program: Gaussian 09
title: 000209142
version: EM64L-G09RevD.01
frameworkgroup: C1[X(C18H15Br3N3P3)]
method: RPBEPBE
basis: SDD
operation: Freq
keyword: #p
keyword: freq=noraman
keyword: PBEPBE/SDD
title: #p freq=noraman PBEPBE/SDD
converged: YES YES NO NO
title: Mulliken charges:
elementType: Br Br Br P P P N N N C C C C C C C C C C C C C C C C C C H H H H H H H H H H H H H H H
charge: -0.079853 -0.079356 -0.079337 0.751821 0.751936 0.752311 -0.737559 -0.738036 -0.745542 -0.094195 -0.092825 -0.093071 -0.228245 -0.228074 -0.229646 -0.228262 -0.229888 -0.228095 -0.215583 -0.215866 -0.215391 -0.215656 -0.215298 -0.215798 -0.214778 -0.214697 -0.214705 0.274999 0.273142 0.274920 0.274265 0.275770 0.273844 0.238966 0.239192 0.238953 0.238971 0.238927 0.239166 0.237466 0.237551 0.237556
chargesum: 0.00000
title: Mulliken charges with hydrogens summed into heavy atoms:
elementType: Br Br Br P P P N N N C C C C C C C C C C C C C C C C C C
charge: -0.079853 -0.079356 -0.079337 0.751821 0.751936 0.752311 -0.737559 -0.738036 -0.745542 -0.094195 -0.092825 -0.093071 0.046754 0.045068 0.045275 0.046003 0.045882 0.045749 0.023383 0.023326 0.023562 0.023315 0.023630 0.023368 0.022688 0.022854 0.022851
polarizability: 3.94402427e+02 -1.15154497e-01 3.91327007e+02 -4.79497919e-02 1.71160207e+00 3.29282024e+02
1716.lowfreq: -11.1258 -4.2320 -2.2593 -0.0009 -0.0005 0.0003 4.1143 18.5656 23.8644
frequency: -10.8811 18.4344 23.7888 25.0580 26.8491 29.8753 44.8596 48.2209 49.0697 54.2321 64.6669 65.6294 96.9695 97.5829 122.2981 178.9030 186.8525 187.6334 201.1669 201.9567 203.4769 264.2457 265.3043 277.9893 290.8558 291.8583 353.9961 355.1021 358.4185 394.4921 395.8093 396.3627 443.7630 446.2072 446.3712 491.4763 492.1942 501.5414 535.1150 598.0957 607.3493 607.5833 608.0920 654.9113 656.4150 694.4413 695.2030 697.2822 706.1138 706.5188 729.8322 761.4295 761.8959 764.0486 853.2545 854.9987 856.2178 857.2933 931.9627 932.9856 936.0878 946.9777 947.8225 981.9723 983.4866 984.1689 986.0640 986.0941 986.3840 1005.7470 1005.9692 1006.2623 1021.5319 1021.7095 1021.9000 1080.4449 1082.0465 1082.3466 1093.7247 1094.7013 1097.9754 1176.1630 1176.3453 1176.4209 1189.2335 1189.2709 1191.5823 1313.2383 1314.3946 1314.7282 1383.1056 1383.5726 1383.7442 1429.5985 1430.8239 1431.0376 1465.6289 1465.9320 1466.4872 1588.4830 1589.5407 1589.7468 1594.3723 1594.6007 1595.1950 3135.4656 3135.5294 3135.6605 3146.2128 3146.3639 3146.7230 3155.1085 3155.4152 3155.6833 3164.7254 3164.9697 3165.2991 3174.0694 3174.2129 3174.4743
redmass: 3.8038 3.8537 5.2772 7.3362 6.3425 7.6098 13.0010 12.2867 12.0053 19.4876 8.3257 8.3694 16.0234 15.7689 6.7155 10.4963 9.2508 9.3001 4.8968 5.2335 5.1762 11.3912 11.3164 13.1982 7.0565 7.0906 9.8677 11.2894 9.6045 2.8063 2.8184 2.8247 6.1605 12.8254 12.5478 3.8761 3.8863 5.8521 12.1856 12.0220 6.5314 6.5308 6.4747 12.8692 12.7076 2.0665 2.0698 2.0911 8.1201 8.1828 8.4685 1.5645 1.5648 1.5575 1.3663 7.1190 1.2597 1.2449 1.3981 1.4022 1.3586 10.9474 10.7436 1.3902 1.3896 1.4033 6.1652 5.9892 6.1802 1.3347 1.3342 1.3329 2.8484 2.8404 2.8176 1.5923 1.5931 1.5939 2.8902 2.8909 2.9540 1.0552 1.0553 1.0553 1.1280 1.1276 1.1273 1.3063 1.3028 1.3022 9.0910 9.1697 9.1647 2.1458 2.1521 2.1538 2.0460 2.0483 2.0452 6.1991 6.2206 6.2231 5.8375 5.8373 5.8046 1.0856 1.0857 1.0856 1.0884 1.0884 1.0884 1.0928 1.0929 1.0928 1.0970 1.0970 1.0970 1.1017 1.1017 1.1017
irintensity: 0.0069 0.0175 0.0047 0.0366 0.2624 0.6816 0.0005 0.3221 0.3364 0.0780 0.0051 0.0214 7.1752 7.3662 0.0019 16.2551 0.3953 0.3424 0.4373 1.2464 0.8420 0.7077 0.7589 5.2021 3.3926 2.6038 49.8539 85.8949 39.0786 0.0124 0.0583 0.0542 96.8310 45.6752 47.0024 44.6189 38.7786 168.0299 100.6911 40.6299 0.0421 0.0516 0.0093 0.0007 0.0260 39.9359 34.5768 70.2838 0.3655 0.1998 2.2388 12.3962 8.8768 87.7022 0.0475 0.1502 0.7013 0.8876 16.2740 18.2286 0.9216 813.1376 808.8512 0.0298 0.0353 0.0014 9.8211 8.9832 2.5931 0.2734 0.2280 0.9706 0.5242 0.3950 3.8722 0.1453 2.5288 3.9508 54.7827 57.5023 28.7588 0.0009 0.1248 0.0840 9.8073 9.9547 7.2509 0.1637 5.7499 6.2222 0.0864 1.0200 1.0697 0.2643 31.7100 31.1474 16.5621 17.0761 12.7586 0.0007 0.0371 0.0438 0.0555 0.0517 0.0082 0.4620 0.4383 0.3337 1.2832 9.8040 8.0978 6.9362 7.6475 5.9824 2.4868 10.1235 10.2283 32.1104 32.1111 22.8910
temp: 298.150 k
press: 1.00000 atm
elementType: 35 35 35 15 15 15 7 7 7 6 6 6 6 6 6 6 6 6 6 6 6 6 6 6 6 6 6 1 1 1 1 1 1 1 1 1 1 1 1 1 1 1
symmnumber: 1
zpe: 757123.3 jmol-1
zpe.correction: 0.288373 hartree
zpe.thermalcorrener: 0.315275 hartree
zpe.thermalcorrenthalpy: 0.316219 hartree
zpe.thermalcorrgfe: 0.224781 hartree
zpe.sumelectzpe: -1921.315017 hartree
zpe.sumelectthermal: -1921.288116 hartree
zpe.sumelectthermalent: -1921.287171 hartree
zpe.sumelectthermalfe: -1921.378609 hartree
dipole: 0.0088 -0.0171 -9.1602
dipole: 9.1603
quadrupole: -176.4816 -177.9922 -210.8390
quadrupole: -0.0606 0.0088 0.4985
quadrupole: 11.9560 10.4454 -22.4014 -0.0606 0.0088 0.4985
hfenergy: -1921.6033902 hartree
pointgroup: C01 [X(C18H15Br3N3P3)]
dipole: -0.5593516 0.0554455 -3.5598239 debye
polarizability: 390.3807146|0.1096292|394.383788|-7.7775004|1.2069128|330.2469557 unknown
InChI: InChI=1S/C18H15N3P3.3Br/c1-4-10-16(11-5-1)22-19-23(17-12-6-2-7-13-17)21-24(20-22)18-14-8-3-9-15-18;;;/h1-15H;;;
charge 0 multiplicity 1
42 atoms
Br 2.953242 -0.045342 2.794965
Br -0.820388 2.139119 3.417689
Br -0.827772 -2.239061 3.351327
P  1.751835 -0.01067 0.667412
P  -0.75211 1.445177 1.075199
P  -0.752912 -1.476987 1.030212
N  0.880846 1.468576 0.52904
N  0.88011 -1.484865 0.484442
N  -1.64694 -0.012943 0.883795
C  3.083797 0.008817 -0.592366
C  -1.657497 2.774794 0.196557
C  -1.657049 -2.778497 0.109089
C  3.574003 1.251084 -1.054513
C  -0.951113 3.922907 -0.227858
C  -3.047127 -2.633071 -0.099491
C  3.588413 -1.218534 -1.078245
C  -3.042692 2.623224 -0.038342
C  -0.944338 -3.898945 -0.374489
C  4.594682 1.25827 -2.029863
C  -1.655016 4.941485 -0.90596
C  -3.735783 -3.638064 -0.812884
C  4.608892 -1.195027 -2.05353
C  -3.732972 3.650647 -0.717417
C  -1.646785 -4.895494 -1.086107
C  5.112867 0.039279 -2.526605
C  -3.042545 4.807825 -1.147891
C  -3.038979 -4.767517 -1.302761
H  3.155397 2.1846 -0.664967
H  0.123713 4.008051 -0.037948
H  -3.568523 -1.748806 0.280936
H  3.181326 -2.164434 -0.706759
H  -3.558498 1.717326 0.296016
H  0.134145 -3.978732 -0.20403
H  4.984475 2.212788 -2.3986
H  -1.121832 5.837125 -1.241373
H  -4.812997 -3.539747 -0.98304
H  5.009756 -2.137632 -2.440582
H  -4.806492 3.547961 -0.907171
H  -1.108627 -5.769472 -1.467552
H  5.907376 0.051162 -3.280723
H  -3.584357 5.603596 -1.670651
H  -3.579528 -5.546076 -1.852065
