program: Gaussian 09
title: 000209118
version: EM64L-G09RevD.01
frameworkgroup: C1[X(C22H28N2O3)]
method: RPBEPBE
basis: SDD
operation: Freq
keyword: #p
keyword: freq=noraman
keyword: PBEPBE/SDD
title: #p freq=noraman PBEPBE/SDD
converged: YES YES NO NO
title: Mulliken charges:
elementType: O O O N N C C C C C C C C C C C C C C C C C C C C C C H H H H H H H H H H H H H H H H H H H H H H H H H H H H
charge: -0.304141 -0.437605 -0.175370 -0.126558 -0.085152 -0.361940 -0.358515 -0.394346 -0.388260 -0.241754 -0.330721 0.414901 0.115862 -0.334948 -0.430985 -0.354117 -0.228685 -0.233184 0.117190 -0.241097 0.352073 0.332560 -0.410086 -0.412299 -0.815999 -0.801744 -0.226793 0.230008 0.191190 0.184778 0.230310 0.193003 0.205478 0.201249 0.200770 0.240767 0.204552 0.189497 0.217241 0.202512 0.240609 0.280105 0.227323 0.227498 0.331952 0.229391 0.234799 0.235044 0.264594 0.223230 0.247925 0.222720 0.237625 0.241909 0.225633
chargesum: 0.00000
title: Mulliken charges with hydrogens summed into heavy atoms:
elementType: O O O N N C C C C C C C C C C C C C C C C C C C C C C
charge: -0.304141 -0.105653 -0.175370 -0.126558 -0.085152 0.059259 0.056573 0.004134 0.013759 -0.000987 0.063328 0.414901 0.115862 0.084806 -0.190376 -0.074012 -0.001362 -0.005685 0.117190 -0.011706 0.352073 0.332560 -0.175287 -0.177255 -0.080250 -0.099489 -0.001161
polarizability: 2.88019005e+02 2.54824260e+00 2.89870002e+02 -4.83163496e+00 -1.14532766e+01 1.95038799e+02
1716.lowfreq: -4.9972 -3.3783 -0.0007 -0.0006 0.0004 4.7066 10.2028 21.8968 26.7706
frequency: 10.0526 21.6338 26.3660 36.6588 44.6743 52.6903 58.3722 66.0073 68.7244 76.0348 87.7255 99.6267 125.3250 144.2508 153.3484 161.2418 197.4389 214.7679 224.4844 236.8528 254.4668 270.3581 291.9462 301.5095 306.5424 310.6493 322.9604 339.2621 354.5252 378.1553 404.1008 411.3924 466.6726 473.0976 482.1341 504.0095 513.2085 518.5854 531.0072 543.1925 590.7962 613.0089 625.7936 667.9901 676.8709 693.1126 706.0656 748.9078 769.6208 778.0713 785.2205 791.0355 806.8085 834.7078 840.1964 851.5749 858.6773 894.8275 897.3360 920.7501 933.7530 950.8367 972.9863 975.4257 983.6162 985.5695 989.7642 1000.1252 1003.2176 1022.1273 1026.3848 1042.5040 1044.9734 1045.5575 1047.0374 1061.3385 1061.9217 1066.0352 1077.5695 1084.7129 1099.7311 1122.8004 1133.3560 1140.4705 1144.5409 1153.1474 1171.8976 1177.1456 1180.5022 1193.1594 1200.1935 1221.7979 1257.1496 1260.8026 1269.6706 1276.8037 1278.2012 1287.4602 1302.5676 1309.6647 1317.6713 1333.2671 1340.3217 1351.0708 1364.9505 1375.2775 1377.7822 1383.8222 1393.3132 1397.5696 1398.4215 1399.6696 1429.2562 1441.9782 1453.5447 1454.3773 1456.0929 1462.8656 1463.2063 1465.2497 1468.3102 1472.4204 1478.3811 1482.6624 1482.8352 1486.6688 1594.2083 1595.8996 1608.9334 1617.0177 1662.1160 2857.9972 2864.6098 2872.1178 2876.5966 2882.7272 2891.4547 2980.1479 2982.3248 2982.6612 3002.1103 3030.7295 3045.4901 3057.5393 3058.8476 3063.1362 3063.2953 3085.7700 3092.6342 3093.0539 3120.7710 3124.2781 3128.2562 3134.5811 3141.0428 3152.9842 3158.7523 3164.8759 3560.4901
redmass: 4.9350 4.3854 4.9676 3.6766 3.8879 3.1315 4.8302 2.7202 2.8787 1.1823 4.2658 3.6614 4.6565 1.4628 1.9894 5.1520 4.2951 4.1082 2.9217 2.8248 2.4038 3.0667 4.4516 2.5309 4.3468 4.0812 1.3579 2.3484 4.1349 3.2151 2.8166 2.1205 3.5696 3.7982 3.3570 4.3226 3.1988 4.6432 4.8590 5.0868 5.0567 5.4560 2.6163 4.0039 6.2815 4.6149 1.8155 2.7132 3.4213 1.7458 2.0994 3.1487 1.2434 3.9760 4.7912 1.5288 1.2518 3.8763 1.3166 2.5016 1.6070 2.9491 2.9247 1.3432 1.3928 1.6212 6.1912 1.3924 2.3111 2.8603 2.2922 1.7929 1.8022 1.5967 1.5253 2.3219 2.1533 2.7511 1.6169 2.0332 2.0383 1.9091 2.8036 2.8078 3.2565 3.1130 1.0638 1.1671 1.1835 2.1162 1.1866 1.8625 1.4972 1.5515 1.2676 3.0615 1.3905 1.3479 1.2678 1.2210 1.3768 1.3039 1.2931 1.2974 1.3488 6.5332 1.3610 3.9236 1.6439 1.4249 1.2495 1.2427 2.3807 2.1177 1.0804 1.1088 1.8053 1.0692 1.0892 1.0563 1.0953 1.1024 2.2652 1.1036 1.2878 1.2252 6.1781 5.6194 6.0960 8.1390 10.6020 1.0707 1.0709 1.0723 1.0750 1.0722 1.0675 1.0380 1.0674 1.0373 1.0895 1.0896 1.0902 1.0879 1.0958 1.0940 1.0915 1.0989 1.0997 1.0996 1.0861 1.0858 1.0876 1.0921 1.0922 1.0957 1.0994 1.1013 1.0662
irintensity: 0.2581 0.2493 0.5940 0.5855 1.7960 1.3600 0.6127 0.0398 2.7035 0.5847 1.3625 1.1044 2.2299 4.0331 4.8636 0.5382 1.1919 1.2147 0.0614 1.7744 0.9898 4.0947 3.1474 12.4375 1.5576 1.0501 93.5135 59.3481 15.5058 12.0013 0.1120 2.5942 0.8580 2.4636 0.2884 6.5891 0.4882 4.8713 3.6549 1.6654 9.3093 0.2724 0.5466 1.0038 3.1333 1.9836 56.3045 42.8379 4.8740 13.8666 57.6486 13.7041 2.4155 19.7673 4.4586 0.8274 0.1188 18.7766 0.3379 4.8645 10.1446 86.1672 57.0326 0.2488 2.0649 11.4672 1.6940 16.6585 110.0316 10.8114 28.9041 5.4768 1.1272 8.2995 3.7074 122.7715 9.0882 352.5938 12.1856 68.6790 22.2433 46.1441 4.3877 15.0142 119.9691 15.1365 0.3386 1.6231 2.0912 1.3856 0.2452 11.7925 34.0297 2.3187 6.4391 6.6915 9.1425 14.4089 20.7588 11.8702 15.2952 2.8687 12.9324 11.3592 14.4549 3.6129 3.6543 1.1633 2.2775 0.7782 8.3452 7.2897 7.5323 13.6330 1.6936 2.0102 0.9532 7.6935 29.4288 14.9810 7.4236 1.5275 16.3081 2.8308 36.7185 49.1456 2.2954 3.5742 4.2038 2.7451 111.9541 74.8054 5.1670 27.2286 21.2796 97.8594 202.3068 27.6690 60.6325 13.2255 26.4407 45.8117 38.6894 30.7848 17.8755 6.7270 17.7082 40.7640 17.1777 30.1152 3.1656 0.0849 1.7448 22.4667 21.6876 19.3999 33.9122 24.0443 7.3525
temp: 298.150 k
press: 1.00000 atm
elementType: 8 8 8 7 7 6 6 6 6 6 6 6 6 6 6 6 6 6 6 6 6 6 6 6 6 6 6 1 1 1 1 1 1 1 1 1 1 1 1 1 1 1 1 1 1 1 1 1 1 1 1 1 1 1 1
symmnumber: 1
zpe: 1199079.1 jmol-1
zpe.correction: 0.456705 hartree
zpe.thermalcorrener: 0.483736 hartree
zpe.thermalcorrenthalpy: 0.484680 hartree
zpe.thermalcorrgfe: 0.395615 hartree
zpe.sumelectzpe: -1188.265570 hartree
zpe.sumelectthermal: -1188.238539 hartree
zpe.sumelectthermalent: -1188.237595 hartree
zpe.sumelectthermalfe: -1188.326660 hartree
dipole: 0.6537 2.4246 2.2240
dipole: 3.3544
quadrupole: -157.1275 -151.1662 -162.7343
quadrupole: -14.2890 -6.5665 -5.1005
quadrupole: -0.1182 5.8432 -5.7250 -14.2890 -6.5665 -5.1005
hfenergy: -1188.7222752 hartree
pointgroup: C01 [X(C22H28N2O3)]
dipole: -0.1793143 0.9951666 -0.8480575 debye
polarizability: 287.982756|-2.8725407|289.1687803|-0.8229695|14.8807511|195.7762702 unknown
InChI: InChI=1S/C22H28N2O3/c1-17-7-6-8-18(2)21(17)27-22(26)20(19-9-4-3-5-10-19)24-13-11-23(12-14-24)15-16-25/h3-10,20,25H,11-16H2,1-2H3
charge 0 multiplicity 1
55 atoms
O  -1.84884 -0.543771 -0.779578
O  7.547901 -2.654525 0.560294
O  -0.941352 -0.576439 1.382864
N  1.578284 0.253031 0.078134
N  4.333109 -0.67774 0.06913
C  2.661192 1.035547 -0.575877
C  1.903695 -1.197979 0.036872
C  4.006503 0.76813 0.116316
C  3.253162 -1.457441 0.724077
C  0.250231 0.571107 -0.49877
C  5.680594 -0.996934 0.595592
C  -0.121622 2.049134 -0.306131
C  -0.86127 -0.249822 0.185965
C  6.236049 -2.304435 -0.008713
C  -0.66705 2.799802 -1.373857
C  0.039526 2.655086 0.965406
C  -1.04235 4.148891 -1.178628
C  -0.333101 4.002547 1.159428
C  -3.064929 -1.209365 -0.37921
C  -0.87599 4.753577 0.088844
C  -4.050621 -0.489136 0.33707
C  -3.226832 -2.544746 -0.819559
C  -5.262628 -1.16868 0.6186
C  -4.45472 -3.182035 -0.515802
C  -3.820638 0.939951 0.784801
C  -2.123096 -3.256785 -1.576676
C  -5.465078 -2.50145 0.199294
H  2.420686 2.11026 -0.505986
H  2.7545 0.76815 -1.658714
H  1.957258 -1.573146 -1.01626
H  1.119746 -1.757343 0.575019
H  3.94727 1.146731 1.168015
H  4.800975 1.330831 -0.408462
H  3.487057 -2.534966 0.657755
H  3.160703 -1.190817 1.806784
H  0.191571 0.330995 -1.588897
H  5.700566 -1.078737 1.710023
H  6.360934 -0.164975 0.321694
H  5.595875 -3.16485 0.245524
H  6.276752 -2.212015 -1.113317
H  -0.800076 2.329074 -2.355347
H  0.462165 2.05879 1.781424
H  -1.460347 4.725278 -2.011533
H  -0.20512 4.46711 2.14372
H  8.20362 -1.955123 0.311118
H  -1.166388 5.799209 0.241462
H  -6.048952 -0.640628 1.170281
H  -4.612633 -4.216149 -0.842907
H  -3.122984 0.974063 1.642611
H  -4.767539 1.411088 1.097308
H  -3.373826 1.553721 -0.017925
H  -2.457873 -4.252274 -1.913592
H  -1.227287 -3.396082 -0.941899
H  -1.801778 -2.676946 -2.460421
H  -6.409807 -3.007774 0.425639
