program: Gaussian 09
title: 000209101
version: EM64L-G09RevD.01
frameworkgroup: C1[X(C14H19N3)]
method: RPBEPBE
basis: SDD
operation: Freq
keyword: #pfreq=noraman
keyword: PBEPBE/SDD
title: #p freq=noraman PBEPBE/SDD
converged: YES YES NO NO
title: Mulliken charges:
elementType: N N N C C C C C C C C C C C C C C H H H H H H H H H H H H H H H H H H H
charge: -0.088663 -0.203111 -0.083224 -0.017718 -0.396157 -0.424827 -0.410083 -0.366831 -0.346817 -0.738943 0.312883 -0.221342 -0.013466 -0.356882 -0.307504 -0.221564 -0.232275 0.216954 0.211770 0.170749 0.216361 0.186927 0.198932 0.213995 0.182566 0.239252 0.203078 0.235556 0.213426 0.220643 0.207785 0.275669 0.230511 0.247409 0.220655 0.224282
chargesum: 0.00000
title: Mulliken charges with hydrogens summed into heavy atoms:
elementType: N N N C C C C C C C C C C C C C C
charge: -0.088663 -0.203111 -0.083224 0.199237 -0.013637 -0.021538 0.002845 0.054987 0.091817 -0.097089 0.312883 0.054327 -0.013466 -0.126371 -0.060095 -0.000909 -0.007993
polarizability: 2.29744195e+02 8.51352484e+00 1.56464248e+02 -1.89992840e+01 -3.31448367e+00 1.15623188e+02
1716.lowfreq: -14.2515 -6.8625 -0.0006 -0.0003 0.0005 3.9070 12.7919 33.4478 50.9576
frequency: 10.2710 33.4436 50.9449 129.0835 145.3954 162.7143 196.7373 206.4892 223.0264 237.8853 276.3432 296.5804 336.4252 364.0188 415.0382 420.6852 430.8651 437.3122 483.6206 540.5156 575.3674 582.2618 610.1399 631.0775 742.9369 751.0369 760.1181 767.8775 777.3134 821.8581 836.5471 855.6840 856.4906 860.9465 890.2582 900.2984 935.1692 962.9823 968.4335 975.1456 985.7128 1005.5031 1007.9444 1058.5634 1060.8018 1090.2826 1107.9402 1124.1026 1129.6159 1155.7111 1157.2207 1165.6398 1176.1414 1185.6795 1200.0695 1227.0418 1255.5933 1268.1612 1281.4251 1288.5650 1293.7931 1307.7755 1320.3348 1328.6879 1341.1357 1346.6088 1360.2761 1370.2762 1388.3583 1399.4600 1402.0094 1444.7896 1452.6043 1457.5548 1461.0428 1464.1454 1470.8889 1475.6661 1478.1843 1479.2786 1486.0733 1587.0969 1624.9228 2831.2008 2845.1626 2877.4200 2956.8355 2969.5607 2981.4627 2991.1418 3003.1678 3013.5245 3031.0706 3045.7251 3054.8079 3063.1479 3070.7027 3127.2890 3139.8124 3155.6921 3170.6631 3242.5750
redmass: 4.2737 3.7111 4.1356 3.0687 3.3726 2.8011 2.8122 1.1532 4.2582 2.3997 1.9883 5.6587 2.2763 2.4860 2.5312 2.8127 2.2372 4.0322 3.5667 3.8192 3.5830 3.9950 4.2235 4.3064 3.9693 1.4125 2.8125 3.6263 4.2288 2.5970 1.3518 1.5167 1.6420 4.2820 1.4584 2.2527 1.3784 1.7890 1.6093 1.3048 1.6952 1.8669 2.0168 2.1378 3.5311 1.9178 2.0561 2.1289 2.0177 1.4031 1.2965 2.2965 1.5820 1.6709 2.2986 1.4811 1.9656 1.3147 1.4277 1.3872 1.4569 1.5086 1.6130 3.8112 1.4540 1.4268 1.5642 1.4728 1.2316 2.7892 1.4571 2.6452 4.6321 1.0912 1.1146 1.0985 3.0874 1.0631 1.1050 1.0597 1.1374 6.9708 7.7527 1.0699 1.0704 1.0685 1.0640 1.0364 1.0810 1.0619 1.0904 1.0888 1.0972 1.0885 1.1031 1.0990 1.0990 1.0853 1.0902 1.0955 1.0990 1.0979
irintensity: 0.0799 0.1033 0.4543 2.1302 0.5205 1.0874 0.0747 0.1685 3.8569 0.4062 3.4185 1.7291 2.7623 1.5024 1.0452 11.3897 0.5462 2.2378 5.0663 0.0694 0.2925 4.7332 2.1536 1.5281 21.5124 96.5194 4.1939 2.3713 3.8269 1.8975 11.0810 8.8293 4.3201 5.9607 4.0578 1.6817 3.3059 4.3271 13.4191 0.1653 5.2751 6.3656 13.0392 39.7669 10.5836 15.9701 10.6609 31.1272 8.1508 8.9441 1.8724 30.7196 27.0370 50.6427 46.6745 27.4995 32.8656 12.9858 3.8755 4.1560 13.5263 39.0196 7.1126 22.2058 1.5448 1.6302 5.2349 19.0169 32.8375 10.8950 32.0480 57.9610 4.5655 13.8456 11.1363 0.5157 10.2218 6.2021 10.8288 10.5456 17.2088 3.4606 11.1394 64.5755 81.2283 91.3351 28.1938 43.2776 31.2380 22.8092 25.3766 54.5468 43.7174 30.5204 33.4678 70.5770 41.9403 0.9631 17.1146 26.1158 21.0590 0.0706
temp: 298.150 k
press: 1.00000 atm
elementType: 7 7 7 6 6 6 6 6 6 6 6 6 6 6 6 6 6 1 1 1 1 1 1 1 1 1 1 1 1 1 1 1 1 1 1 1
symmnumber: 1
zpe: 805702.7 jmol-1
zpe.correction: 0.306876 hartree
zpe.thermalcorrener: 0.321916 hartree
zpe.thermalcorrenthalpy: 0.322860 hartree
zpe.thermalcorrgfe: 0.263006 hartree
zpe.sumelectzpe: -707.871776 hartree
zpe.sumelectthermal: -707.856736 hartree
zpe.sumelectthermalent: -707.855792 hartree
zpe.sumelectthermalfe: -707.915646 hartree
dipole: 3.7043 -3.4205 0.0043
dipole: 5.0420
quadrupole: -98.8703 -105.2316 -102.6211
quadrupole: 6.9920 -2.9808 1.1966
quadrupole: 3.3707 -2.9906 -0.3801 6.9920 -2.9808 1.1966
hfenergy: -708.1786517 hartree
pointgroup: C01 [X(C14H19N3)]
dipole: -1.452165 -1.3231575 -0.2746774 debye
polarizability: 230.3126418|-4.8714125|153.7995374|-18.6633674|10.5088333|117.7194514 unknown
InChI: InChI=1S/C14H19N3/c1-12-5-4-8-16(9-12)11-17-10-15-13-6-2-3-7-14(13)17/h2-3,6-7,10,12H,4-5,8-9,11H2,1H3
charge 0 multiplicity 1
36 atoms
N  -1.652679 -0.1960 0.184426
N  0.722875 0.00433 0.611215
N  1.994747 1.90272 0.825211
C  -4.135485 0.095396 0.28926
C  -2.92202 -0.777636 0.686381
C  -4.156663 0.286892 -1.247768
C  -2.808411 0.844471 -1.756733
C  -1.638635 -0.043987 -1.293354
C  -0.459086 -0.870345 0.706814
C  -5.449162 -0.522077 0.810627
C  2.021415 -0.35766 0.20693
C  0.776327 1.359258 0.971905
C  2.803163 0.842572 0.345081
C  2.580407 -1.570569 -0.251438
C  4.176766 0.834409 0.011789
C  3.952698 -1.555318 -0.580673
C  4.739546 -0.372565 -0.451296
H  -3.989054 1.090557 0.757354
H  -2.861098 -0.852939 1.789401
H  -3.086774 -1.813958 0.287911
H  -4.986799 0.961345 -1.532823
H  -4.359247 -0.693977 -1.728945
H  -2.804072 0.90601 -2.861602
H  -2.655905 1.868297 -1.364783
H  -1.710835 -1.0454 -1.793569
H  -0.674114 0.406197 -1.588378
H  -0.204978 -1.812077 0.161222
H  -0.649558 -1.136175 1.76464
H  -5.439162 -0.631496 1.911475
H  -6.314786 0.11136 0.542915
H  -5.618476 -1.5242 0.370973
H  -0.114364 1.885634 1.306363
H  1.992647 -2.489677 -0.348704
H  4.773418 1.74581 0.116314
H  4.426047 -2.475371 -0.941553
H  5.802005 -0.408329 -0.715886
