program: Gaussian 09
title: 000209079
version: EM64L-G09RevD.01
frameworkgroup: C1[X(C13H14ClNO2)]
method: RPBEPBE
basis: SDD
operation: Freq
keyword: #p
keyword: freq=noraman
keyword: PBEPBE/SDD
title: #p freq=noraman PBEPBE/SDD
converged: YES YES NO NO
title: Mulliken charges:
elementType: Cl O O N C C C C C C C C C C C C C H H H H H H H H H H H H H H
charge: -0.048425 -0.242608 -0.306490 -0.173332 -0.355814 -0.369461 -0.289904 -0.302635 0.242520 -0.333348 -0.264666 0.498468 -0.363524 -0.379351 -0.218390 -0.222760 -0.108906 0.201431 0.231524 0.226261 0.271293 0.222544 0.195313 0.203971 0.224197 0.200814 0.273777 0.227726 0.244888 0.256009 0.258880
chargesum: 0.00000
title: Mulliken charges with hydrogens summed into heavy atoms:
elementType: Cl O O N C C C C C C C C C C C C C
charge: -0.048425 -0.242608 -0.306490 -0.173332 0.077141 0.128094 0.127953 0.125533 0.242520 -0.132534 0.009111 0.498468 -0.135798 -0.134464 0.037619 0.036119 -0.108906
polarizability: 3.28418071e+02 3.15512118e+00 1.55324093e+02 -8.83752057e+00 9.26738418e+00 8.40152133e+01
1716.lowfreq: -13.1420 -4.7375 -0.0017 -0.0014 0.0006 1.2760 18.1653 29.4359 48.4487
frequency: 14.6283 29.1379 48.3643 49.8568 80.7545 124.6206 157.2659 173.4226 192.5348 216.9920 288.3165 290.8848 342.0005 346.7095 377.9539 403.9868 409.7022 428.9322 456.7950 496.0809 516.4146 561.2825 609.2759 627.5502 651.7680 667.7411 723.0899 772.7314 797.1541 823.3695 826.6689 830.7437 863.1529 868.8799 898.8316 953.1479 956.1235 965.8260 997.8234 1008.9231 1012.1358 1032.0955 1049.0254 1069.9463 1074.3540 1105.7792 1109.9438 1177.8790 1186.7980 1191.4533 1201.2927 1217.8585 1250.4520 1273.2004 1287.1084 1298.5598 1314.4815 1331.8218 1340.0429 1350.4342 1364.8215 1373.2602 1402.7964 1413.6653 1446.5417 1449.1826 1455.5582 1458.9948 1479.9058 1538.6531 1573.1909 1598.2434 1642.7927 2950.1597 2962.9296 2977.6377 2985.2320 3081.0539 3085.9520 3091.3301 3100.5707 3105.7942 3138.1297 3141.0463 3149.3970 3170.7838 3174.7473
redmass: 3.9594 4.3607 5.4069 6.0565 7.4380 2.4714 4.1944 6.1654 8.0583 3.0287 3.3129 3.5535 4.3020 4.5674 5.6634 2.0290 2.8586 5.0223 3.1519 2.7310 4.4320 3.3981 2.9171 6.9096 4.6412 4.3038 3.6392 5.4673 4.3079 1.3176 1.5611 1.6706 3.9916 1.8883 2.4307 1.3593 3.2225 1.3707 4.0291 2.2852 1.2541 2.5711 2.2427 3.4391 2.7860 2.0623 1.4492 2.8759 1.1350 1.0712 1.9396 1.4603 1.5225 1.2061 1.8966 1.3974 1.3357 1.3009 1.2246 1.3327 1.3786 3.7598 3.5160 2.5640 1.0832 1.0844 1.1199 1.1121 2.4653 8.5492 7.1935 6.1234 5.8043 1.0678 1.0678 1.0677 1.0648 1.0969 1.0956 1.0992 1.0932 1.0896 1.0900 1.0889 1.0884 1.0957 1.0964
irintensity: 0.0114 0.4937 0.3280 0.8206 4.1194 0.6524 0.9634 0.3969 0.4828 4.4228 12.2758 4.3276 0.0865 10.2373 16.4492 5.0009 0.0943 7.5938 2.4059 25.4084 12.3796 27.9417 3.5138 0.2855 4.7132 0.8808 0.2990 17.7498 10.6103 12.4546 68.9491 7.5188 28.2398 1.3267 2.1537 2.4679 16.8108 0.2448 39.1735 11.9519 41.1069 60.2105 33.2483 30.7557 70.3133 12.3699 5.9396 22.7729 13.3955 2.3290 228.8299 4.1962 44.1808 7.8776 50.2343 24.0807 3.6543 2.8255 7.8844 1.8027 0.5430 13.6857 12.7545 198.6242 11.6723 5.7265 27.6762 7.7087 124.5848 174.7387 5.0854 32.5202 111.6688 45.5676 52.2116 39.4300 81.2435 37.8522 16.5994 39.3582 19.7550 0.2636 4.2458 10.4906 21.3767 7.2156 2.1697
temp: 298.150 k
press: 1.00000 atm
elementType: 17 8 8 7 6 6 6 6 6 6 6 6 6 6 6 6 6 1 1 1 1 1 1 1 1 1 1 1 1 1 1
symmnumber: 1
zpe: 640220.3 jmol-1
zpe.correction: 0.243847 hartree
zpe.thermalcorrener: 0.259519 hartree
zpe.thermalcorrenthalpy: 0.260464 hartree
zpe.thermalcorrgfe: 0.197701 hartree
zpe.sumelectzpe: -1167.774102 hartree
zpe.sumelectthermal: -1167.758430 hartree
zpe.sumelectthermalent: -1167.757485 hartree
zpe.sumelectthermalfe: -1167.820248 hartree
dipole: 0.3891 -2.3235 -0.2997
dipole: 2.3749
quadrupole: -120.3391 -104.7834 -108.9688
quadrupole: -4.3906 -2.0421 2.8816
quadrupole: -8.9754 6.5803 2.3950 -4.3906 -2.0421 2.8816
hfenergy: -1168.0179489 hartree
pointgroup: C01 [X(C13H14Cl1N1O2)]
dipole: -0.1600757 -0.8637107 0.3184303 debye
polarizability: 328.3821615|-6.2492541|147.8249748|-7.4057088|-23.8131465|91.5502404 unknown
InChI: InChI=1S/C13H14ClNO2/c14-12-4-1-11(2-5-12)3-6-13(16)15-7-9-17-10-8-15/h1-6H,7-10H2
charge 0 multiplicity 1
31 atoms
Cl 6.615362 -0.878752 0.075393
O  -5.249821 -1.33436 -0.148423
O  -1.779155 2.0903 -0.51375
N  -2.844593 0.195049 0.309405
C  -2.950002 -1.196781 0.793468
C  -4.158186 0.872034 0.198225
C  -3.936011 -1.989173 -0.096927
C  -5.109239 0.037362 -0.677882
C  -1.689921 0.900041 -0.054382
C  -0.365333 0.235537 0.118268
C  0.768752 0.897857 -0.263538
C  2.157153 0.427485 -0.163892
C  2.522212 -0.851134 0.351855
C  3.20083 1.291547 -0.604535
C  3.869478 -1.251582 0.425814
C  4.556121 0.908085 -0.537208
C  4.871116 -0.36321 -0.020697
H  -1.970769 -1.698478 0.786003
H  -3.331179 -1.192881 1.835168
H  -4.593266 0.984583 1.211691
H  -3.983407 1.871238 -0.233693
H  -4.121597 -2.992334 0.321658
H  -3.5176 -2.083999 -1.122895
H  -4.728247 -0.00096 -1.720713
H  -6.127515 0.458466 -0.670699
H  -0.304521 -0.761539 0.564879
H  0.61185 1.899192 -0.690182
H  1.750376 -1.545721 0.699967
H  2.944114 2.279475 -1.004131
H  4.141705 -2.234182 0.8219
H  5.347895 1.581236 -0.877552
