program: Gaussian 09
title: 000209075
version: EM64L-G09RevD.01
frameworkgroup: C1[X(C19H24O7S)]
method: RPBEPBE
basis: SDD
operation: Freq
keyword: #p
keyword: freq=noraman
keyword: PBEPBE/SDD
title: #p freq=noraman PBEPBE/SDD
converged: YES YES NO NO
title: Mulliken charges:
elementType: S O O O O O O O C C C C C C C C C C C C C C C C C C C H H H H H H H H H H H H H H H H H H H H H H H H
charge: 0.084886 -0.246854 -0.293591 -0.244332 -0.323050 -0.208763 -0.261653 -0.286361 -0.071566 -0.177406 -0.117439 -0.091888 -0.094602 0.363616 -0.376338 0.372978 -0.681080 -0.683899 -0.679916 -0.707615 -0.162510 0.399965 -0.312683 -0.359752 -0.200684 -0.192980 -0.241211 0.226131 0.267176 0.328860 0.263707 0.273982 0.251588 0.210591 0.223769 0.223870 0.240917 0.237231 0.220338 0.226815 0.219736 0.224548 0.229358 0.229787 0.246715 0.210649 0.289699 0.253364 0.231379 0.232699 0.231820
chargesum: 0.00000
title: Mulliken charges with hydrogens summed into heavy atoms:
elementType: S O O O O O O O C C C C C C C C C C C C C C C C C C C
charge: 0.084886 -0.246854 -0.293591 -0.244332 -0.323050 -0.208763 -0.261653 -0.286361 0.154565 0.089770 0.211421 0.171819 0.179379 0.363616 0.085841 0.372978 0.007475 0.000485 -0.006273 -0.020464 -0.162510 0.399965 -0.022984 -0.106388 0.030695 0.039719 -0.009391
polarizability: 2.97528840e+02 -4.42987147e+00 2.23298104e+02 2.73254016e+00 -7.34704686e-01 2.00305587e+02
1716.lowfreq: -3.4405 0.0012 0.0014 0.0017 2.2858 6.9563 10.6273 13.9272 27.7688
frequency: 9.9068 13.4809 27.7603 32.0386 40.6654 47.5133 51.4073 59.5796 75.1738 80.8508 89.3702 121.5536 141.3700 163.2389 180.4732 190.9781 200.8276 203.7230 222.3898 228.4391 241.3171 250.7695 300.3570 321.9517 332.8422 346.1227 353.9844 374.7366 389.8169 397.9507 410.1798 411.1054 424.5320 448.4563 468.1529 477.0976 506.1813 532.2347 560.3862 604.0898 608.9764 614.3517 617.2056 635.7937 672.3816 685.1303 690.4330 721.6374 732.0234 745.0460 750.8848 764.3651 769.8318 814.3209 823.3031 840.5963 852.4921 871.0339 880.7788 894.1330 916.3794 920.7870 922.3583 928.7008 936.0618 948.4989 968.2860 973.2842 981.5577 982.9441 986.4436 987.4789 994.0575 1004.9552 1015.2787 1021.1791 1037.0032 1062.1262 1072.7691 1074.9178 1103.2258 1135.8802 1139.5646 1145.7509 1158.7445 1172.0822 1181.4832 1183.8665 1204.8722 1210.5602 1210.9291 1226.2345 1240.3616 1246.3966 1256.4494 1259.7430 1263.8985 1272.0936 1288.6864 1298.4244 1310.0780 1319.9271 1323.3163 1326.8949 1375.1200 1377.8347 1381.0374 1385.7733 1391.3004 1393.1489 1442.2176 1447.8246 1452.8568 1453.1864 1453.7177 1467.4327 1469.1301 1472.9059 1473.2873 1474.1082 1481.0727 1599.3823 1608.7045 2981.1100 2985.2587 2994.9633 3001.3735 3003.4755 3005.2251 3051.9660 3057.5296 3095.1615 3097.7367 3101.1850 3105.7991 3109.2276 3111.6726 3112.6716 3116.1768 3117.3113 3123.9020 3132.7791 3133.3556 3144.8716 3160.2532 3171.3509 3177.5549
redmass: 4.1738 3.7924 4.7624 6.0415 6.5525 4.0753 3.8556 6.0679 4.7517 6.5420 6.8007 5.7015 6.2559 1.0459 1.1749 2.1379 2.2718 5.0654 1.7972 1.2518 2.6593 3.2316 3.5966 3.5530 2.9853 3.2756 3.0122 3.8347 4.3317 3.4865 4.7041 3.6552 4.2936 3.8530 4.0178 3.6948 5.0070 5.2879 9.7098 5.7150 6.3731 4.6605 6.2051 5.3501 5.0369 5.7011 2.2644 6.3936 7.1907 4.4540 3.4380 2.6441 2.4675 5.9357 4.9874 1.2428 4.1071 6.6225 3.1943 2.9151 1.6666 1.3964 1.6240 3.5034 2.2062 2.3745 4.8038 1.3748 1.3636 1.3818 5.5412 4.4085 1.3217 3.3926 3.7627 2.1557 5.2034 2.1199 2.4454 1.5257 5.9078 1.8755 1.9344 2.1249 2.0203 1.0750 1.4209 1.3751 2.7441 3.4266 3.0036 2.2675 2.6806 1.3191 1.8427 1.7923 1.4722 1.3202 1.4868 1.2638 1.3078 1.2766 1.2864 1.2762 1.5952 1.2988 1.2954 9.9131 1.2382 1.2203 2.1955 1.0494 1.0496 1.0491 1.0629 1.0586 1.2334 1.6963 1.0634 1.0590 1.0760 6.0456 7.0534 1.0708 1.0808 1.0363 1.0352 1.0356 1.0356 1.0867 1.0878 1.0998 1.1001 1.1002 1.0994 1.0996 1.0946 1.0959 1.1004 1.1009 1.0973 1.0873 1.0854 1.0899 1.0941 1.0964 1.1005
irintensity: 0.2885 0.1249 0.3156 0.2429 0.0871 0.3891 1.1942 0.1153 0.4377 1.2841 2.4871 1.7788 0.3389 0.0178 1.1823 5.5106 2.2465 3.5606 0.6541 1.7088 1.6333 2.4501 1.1343 7.3353 0.2556 4.7240 2.1224 4.3792 6.7082 2.1780 1.4712 0.9113 9.0524 2.0048 13.1503 13.3214 11.5919 10.9636 1.1386 16.7016 2.7514 2.6286 6.2929 5.8184 10.2340 1.3589 27.3021 21.4805 33.6370 45.1757 42.8683 27.4154 56.5067 19.9945 28.4913 0.9890 10.2289 5.8780 23.7716 45.3430 16.2537 3.2662 45.2353 324.4795 15.6602 62.2048 7.2945 0.2698 2.9098 0.9088 16.3940 13.1955 0.2211 66.9717 140.6589 11.0432 96.9894 54.2155 28.4485 8.2861 629.5358 59.9199 39.7264 11.1578 79.9430 3.5310 38.7295 6.1832 102.4727 518.5078 76.7378 42.2590 47.6294 4.5279 27.6646 25.8397 32.8544 3.0261 24.5095 0.6046 0.4699 4.3389 5.8240 0.1248 6.7793 40.8559 42.0413 1.7257 22.1284 25.8461 6.9144 0.9887 2.8434 5.4663 1.4097 5.0769 17.0356 51.5675 1.6987 38.7509 4.4357 21.4244 6.1336 35.7551 29.9900 20.8086 9.3347 10.8527 12.6848 14.9732 20.3789 30.2198 0.6721 0.6434 40.8348 29.0321 7.5723 27.6851 32.2423 19.7749 12.8782 5.1477 0.7578 16.4127 20.6383 3.8598 11.8971
temp: 298.150 k
press: 1.00000 atm
elementType: 16 8 8 8 8 8 8 8 6 6 6 6 6 6 6 6 6 6 6 6 6 6 6 6 6 6 6 1 1 1 1 1 1 1 1 1 1 1 1 1 1 1 1 1 1 1 1 1 1 1 1
symmnumber: 1
zpe: 1054054.8 jmol-1
zpe.correction: 0.401468 hartree
zpe.thermalcorrener: 0.428368 hartree
zpe.thermalcorrenthalpy: 0.429313 hartree
zpe.thermalcorrgfe: 0.340223 hartree
zpe.sumelectzpe: -1660.950194 hartree
zpe.sumelectthermal: -1660.923294 hartree
zpe.sumelectthermalent: -1660.922350 hartree
zpe.sumelectthermalfe: -1661.011439 hartree
dipole: 0.2685 -0.1230 -4.6381
dipole: 4.6475
quadrupole: -150.4487 -160.9018 -173.1298
quadrupole: -5.0829 4.0636 -0.7246
quadrupole: 11.0447 0.5917 -11.6364 -5.0829 4.0636 -0.7246
hfenergy: -1661.3516625 hartree
pointgroup: C01 [X(C19H24O7S1)]
dipole: 0.228443 0.3191855 -1.7858552 debye
polarizability: 246.6434561|-35.3986389|273.1486793|1.4024703|5.9929649|201.340396 unknown
InChI: InChI=1S/C19H24O7S/c1-18(2)20-10-12(24-18)13-14(15-16(22-13)26-19(3,4)25-15)23-17(27)21-11-8-6-5-7-9-11/h5-9,12-16H,10H2,1-4H3
charge 0 multiplicity 1
51 atoms
S  2.078827 -1.065071 2.973897
O  -2.328936 1.638826 1.182048
O  -0.443073 3.49012 -0.544564
O  -2.258027 4.069042 0.872128
O  -1.045381 -1.58423 -0.210205
O  0.564321 0.721472 1.685864
O  -3.197078 -2.478911 0.14447
O  2.095488 -0.286138 0.329589
C  -1.501433 0.774893 0.295491
C  -0.245689 2.793775 0.739779
C  -0.055362 1.297728 0.448597
C  -1.622827 2.905277 1.452177
C  -1.759572 -0.673092 0.723793
C  -1.692529 4.319009 -0.482757
C  -3.25099 -1.077684 0.601336
C  -2.03793 -2.57329 -0.759196
C  -2.654247 3.838252 -1.57245
C  -1.330662 5.800933 -0.570254
C  -2.404979 -2.167868 -2.195825
C  -1.459126 -3.980014 -0.63673
C  1.573093 -0.214492 1.619341
C  2.955617 -1.377904 -0.039637
C  2.378558 -2.638798 -0.279793
C  4.321431 -1.113375 -0.238075
C  3.219517 -3.681745 -0.726504
C  5.148385 -2.167987 -0.689942
C  4.600976 -3.4495 -0.931159
H  -1.809544 0.91316 -0.761455
H  0.593512 3.23037 1.305635
H  0.57734 1.101384 -0.426301
H  -1.623719 3.055477 2.540482
H  -1.373109 -0.84114 1.743355
H  -3.78396 -1.068801 1.561747
H  -3.788672 -0.438239 -0.12688
H  -3.562292 4.46501 -1.574616
H  -2.169618 3.90932 -2.561404
H  -2.953877 2.79398 -1.388505
H  -0.597391 6.059122 0.211036
H  -0.89579 6.027728 -1.558482
H  -2.233811 6.418795 -0.427434
H  -2.897309 -1.180114 -2.215501
H  -3.093665 -2.910443 -2.634786
H  -1.494776 -2.113795 -2.817337
H  -2.215712 -4.724537 -0.937951
H  -1.167428 -4.172416 0.408181
H  -0.577244 -4.090026 -1.291235
H  1.304463 -2.77707 -0.122862
H  4.721089 -0.114777 -0.038626
H  2.796386 -4.674339 -0.915674
H  6.216728 -1.986881 -0.84874
H  5.24703 -4.263195 -1.277763
