program: Gaussian 09
title: 000209049
version: EM64L-G09RevD.01
frameworkgroup: C1[X(C10H13N3OS)]
method: RPBEPBE
basis: SDD
operation: Freq
keyword: #p
keyword: freq=noraman
keyword: PBEPBE/SDD
title: #p freq=noraman PBEPBE/SDD
converged: YES YES NO NO
title: Mulliken charges:
elementType: S O N N N C C C C C C C C C C H H H H H H H H H H H H H
charge: 0.244249 -0.303383 -0.034020 0.022394 -0.005283 -0.378611 -0.366721 -0.239125 -0.645543 -0.629769 0.458467 -0.312660 -0.312890 -0.354209 -0.346967 0.282906 0.243641 0.244718 0.235268 0.240067 0.215677 0.236381 0.268401 0.222711 0.297670 0.242320 0.238194 0.236116
chargesum: 0.00000
title: Mulliken charges with hydrogens summed into heavy atoms:
elementType: S O N N N C C C C C C C C C C
charge: 0.244249 -0.303383 -0.034020 0.022394 -0.005283 -0.095705 0.121638 -0.239125 0.045469 0.097725 0.458467 -0.014990 -0.070570 -0.116015 -0.110851
polarizability: 2.31307318e+02 7.89718599e+00 1.68733574e+02 -6.60891532e-01 6.03714545e+00 8.56110864e+01
1716.lowfreq: -3.5694 0.0014 0.0016 0.0021 10.5849 18.1582 42.0232 50.5285 69.2103
frequency: 41.7560 50.5225 69.1209 127.0286 147.6456 178.0129 191.9815 228.1341 241.5223 250.7170 289.8828 313.6993 344.0880 374.8921 377.8126 389.5031 410.8558 430.2865 482.8502 539.3728 566.8612 608.4788 622.9507 655.4199 664.7560 742.8599 815.8779 835.1915 886.1389 895.3350 926.3182 941.1045 956.2388 959.5785 971.1551 983.1647 1009.1904 1062.5215 1083.3471 1087.8830 1096.4358 1124.9585 1140.6333 1151.8491 1199.8478 1225.5189 1237.5845 1274.0149 1288.8483 1306.0913 1312.8857 1328.2964 1361.7370 1396.2783 1400.6053 1426.5446 1445.3055 1452.6339 1458.1323 1465.7894 1472.8152 1476.2424 1485.2506 1518.3409 1573.2806 2945.2493 2973.1700 2977.2787 3045.5954 3061.8807 3072.8605 3077.9871 3100.5618 3129.0218 3132.1208 3133.2661 3164.6492 3212.0958
redmass: 3.7358 4.4877 4.6236 3.7361 4.3558 3.2784 1.2703 1.6748 1.6462 3.8640 4.1491 4.3464 5.3798 4.6219 2.7286 3.9787 5.0029 5.2086 3.8228 3.8389 4.6227 6.6756 6.8319 6.1262 6.8369 3.5099 4.7213 1.4972 1.2492 1.7981 1.6968 4.0844 4.2889 6.7525 1.4044 1.4220 1.6326 2.1022 1.9178 2.3437 1.5719 2.2266 2.1062 2.3648 2.6077 1.2752 1.5176 1.5854 2.2548 1.6294 3.5070 1.5728 1.3757 1.2148 1.9975 1.1350 2.1693 1.1121 1.1335 1.0873 1.0712 1.5651 1.6171 7.1208 5.5360 1.0667 1.0428 1.0385 1.0873 1.0960 1.0954 1.0921 1.1000 1.0881 1.1000 1.0921 1.0951 1.0936
irintensity: 0.3690 0.5049 2.2585 0.9296 2.8875 2.0055 0.5463 3.5002 2.9261 0.8575 11.5738 2.0851 5.4242 2.7428 0.7212 10.5107 2.2947 4.7088 1.3662 14.6982 6.2578 3.6090 22.7975 30.6548 4.9807 0.5205 2.6387 65.4956 2.2243 10.2812 7.4424 49.5468 41.5659 2.0741 1.3797 1.8084 5.9567 9.6959 26.3804 5.6428 6.1620 62.5659 5.7228 10.6422 5.9175 2.8235 3.7255 19.2169 15.0959 2.6693 2.0389 7.6633 9.1804 12.1165 42.1904 13.3402 17.5835 13.7640 6.1002 22.5179 29.6533 89.4851 35.7211 16.0177 89.3188 30.2416 59.8916 32.0567 3.2132 4.5495 30.1766 25.2161 24.6970 31.3979 7.4451 18.6403 9.0309 7.1342
temp: 298.150 k
press: 1.00000 atm
elementType: 16 8 7 7 7 6 6 6 6 6 6 6 6 6 6 1 1 1 1 1 1 1 1 1 1 1 1 1
symmnumber: 1
zpe: 576598.3 jmol-1
zpe.correction: 0.219615 hartree
zpe.thermalcorrener: 0.233878 hartree
zpe.thermalcorrenthalpy: 0.234822 hartree
zpe.thermalcorrgfe: 0.178192 hartree
zpe.sumelectzpe: -1025.189047 hartree
zpe.sumelectthermal: -1025.174784 hartree
zpe.sumelectthermalent: -1025.173840 hartree
zpe.sumelectthermalfe: -1025.230469 hartree
dipole: 7.1795 -1.4327 1.2165
dipole: 7.4214
quadrupole: -97.7673 -91.8130 -99.2833
quadrupole: -0.4087 4.6762 -1.3321
quadrupole: -1.4795 4.4749 -2.9954 -0.4087 4.6762 -1.3321
hfenergy: -1025.4086618 hartree
pointgroup: C01 [X(C10H13N3O1S1)]
dipole: -2.8691372 -0.3265706 -0.4320557 debye
polarizability: 229.9321677|-8.3915548|166.3882626|-11.1985715|16.9737719|89.3315484 unknown
InChI: InChI=1S/C10H13N3OS/c1-8-7-12(2)13(14)10(15-8)9-3-5-11-6-4-9/h3-6,8H,7H2,1-2H3
charge 0 multiplicity 1
28 atoms
S  -1.115799 -1.685902 0.768272
O  -0.387866 2.268374 0.640144
N  -2.353407 0.947114 0.768355
N  -0.909432 1.052944 0.636114
N  4.021172 -0.386972 -0.47772
C  -2.827013 -1.365462 -0.057217
C  -2.939013 0.141275 -0.339651
C  -0.228201 -0.114974 0.457076
C  -3.008111 -2.231651 -1.309851
C  -2.989459 2.244613 1.074826
C  1.205329 -0.168796 0.146108
C  2.077577 0.96553 0.192038
C  1.807913 -1.412851 -0.222966
C  3.442402 0.800402 -0.124772
C  3.182934 -1.468801 -0.517296
H  -3.534604 -1.649011 0.740552
H  -2.433738 0.380251 -1.301275
H  -4.002589 0.422464 -0.434746
H  -2.251174 -1.980818 -2.074088
H  -2.909759 -3.303922 -1.06951
H  -4.013363 -2.076041 -1.748792
H  -2.962484 2.958961 0.228162
H  -2.474035 2.709231 1.927776
H  -4.034398 2.031262 1.355356
H  1.689692 1.94427 0.471503
H  1.204069 -2.322364 -0.288828
H  4.116704 1.664149 -0.0928
H  3.647448 -2.419873 -0.802274
