program: Gaussian 09
title: 000208998
version: EM64L-G09RevD.01
frameworkgroup: C1[X(C19H23NO4)]
method: RPBEPBE
basis: SDD
operation: Freq
keyword: #p
keyword: freq=noraman
keyword: PBEPBE/SDD
title: #p freq=noraman PBEPBE/SDD
converged: YES YES NO NO
title: Mulliken charges:
elementType: O O O O N C C C C C C C C C C C C C C C C C C C H H H H H H H H H H H H H H H H H H H H H H H
charge: -0.435626 -0.290202 -0.283281 -0.290494 -0.129817 -0.132054 -0.604571 0.499735 -0.352262 -0.409486 -0.393351 0.549248 -0.342783 -0.571087 -0.583229 0.296996 0.254583 0.053486 -0.228491 -0.231944 -0.242637 -0.531412 -0.497700 -0.521396 0.225521 0.223223 0.209850 0.188114 0.208240 0.232818 0.241428 0.229360 0.260188 0.286818 0.223948 0.227627 0.228257 0.344084 0.225764 0.231254 0.241807 0.227900 0.252333 0.204508 0.268881 0.205398 0.230452
chargesum: 0.00000
title: Mulliken charges with hydrogens summed into heavy atoms:
elementType: O O O O N C C C C C C C C C C C C C C C C C C C
charge: -0.091541 -0.290202 -0.283281 -0.290494 -0.129817 0.093467 -0.171498 0.499735 0.044092 -0.176668 -0.151924 0.549248 -0.113423 -0.310899 -0.296411 0.296996 0.254583 0.053486 -0.004543 -0.004317 -0.014380 0.167414 0.187041 0.183336
polarizability: 3.12951838e+02 1.98373383e+01 2.47044224e+02 -2.62631106e+01 2.12859325e+01 1.68255770e+02
1716.lowfreq: -12.6369 -2.5973 -0.0009 -0.0007 -0.0004 3.8260 10.2018 17.6471 21.1769
frequency: 2.0227 17.4524 20.9043 44.6167 49.5923 53.9509 62.9704 80.0956 91.5596 97.6167 116.1293 125.6407 147.3242 149.0536 185.8727 192.9198 204.4263 222.8945 231.2045 252.0770 264.8914 279.0490 292.5561 306.8426 319.4633 332.5836 360.9457 382.6644 402.2435 438.1272 448.7607 462.5452 486.6912 499.4162 529.5665 550.5173 582.1266 586.4623 617.3447 625.7790 641.3516 653.8009 703.0501 732.2994 757.1008 763.1448 807.8480 852.5842 855.5457 867.2545 869.4792 875.5235 894.8987 917.7622 945.2631 946.8366 970.2008 975.2297 986.1181 990.4726 994.8656 1022.8039 1026.3166 1030.3459 1038.4672 1071.9074 1079.7837 1088.4877 1108.3132 1108.7998 1113.3582 1134.4051 1152.1944 1158.2744 1160.1172 1168.1833 1172.5731 1187.4439 1200.4694 1205.3528 1217.0061 1221.3124 1248.2041 1300.9100 1312.2849 1321.9447 1325.4636 1331.6529 1369.4540 1378.4785 1382.6921 1398.1616 1407.7744 1418.1232 1439.8858 1441.9427 1444.6358 1453.1143 1454.0122 1457.9238 1464.3027 1467.1160 1468.9340 1471.5025 1481.1736 1483.1571 1483.8649 1573.2776 1591.6758 1603.7008 1612.6357 1617.1834 2925.6033 2953.0916 2956.8237 2967.3960 2969.6996 2976.9259 2988.8834 3051.2174 3058.7545 3076.7585 3083.8278 3088.1090 3113.2125 3122.5384 3125.5279 3126.2976 3128.8242 3133.7950 3145.6068 3154.3238 3163.2835 3171.7651 3500.7505
redmass: 4.5172 5.4991 4.1580 3.8646 3.7215 4.5306 4.2438 4.2259 1.5948 3.5958 2.8905 3.8409 1.6730 4.5962 1.9457 2.0485 1.5707 3.1314 4.0404 2.9366 2.2784 2.9602 4.1227 5.1628 3.6728 3.7693 2.7509 3.8706 2.8121 5.3181 3.8103 4.7880 1.1536 3.5986 4.9409 4.2705 4.6454 3.7839 6.2790 4.6558 4.1897 4.2879 1.8017 4.1046 2.8235 2.3990 4.1730 1.3627 2.5288 2.9135 1.9699 1.5153 1.6048 1.4743 6.2083 9.0272 1.9582 1.4097 4.2481 5.6203 1.3325 3.6636 2.4038 2.1420 2.4708 4.8230 2.7830 1.6407 1.2496 1.2365 1.2578 2.2133 1.3609 1.6195 1.5106 1.2710 1.0659 1.1158 2.0862 1.2822 2.4924 1.5222 1.2249 1.3571 3.8388 1.4118 1.2281 1.2685 2.3951 1.2416 6.9804 2.4926 2.2978 1.2549 2.1282 1.2607 1.4133 1.1259 1.1119 1.1033 1.0554 1.1396 1.4214 1.0932 1.4941 1.1013 2.2839 8.0942 6.0069 6.6231 6.2538 6.7601 1.0825 1.0691 1.0862 1.0325 1.0361 1.0350 1.0604 1.1009 1.1042 1.0957 1.0949 1.0963 1.0872 1.0863 1.1056 1.1005 1.1050 1.0913 1.0959 1.0918 1.1015 1.0908 1.0649
irintensity: 0.5644 0.2088 0.3286 2.0273 1.8317 2.6549 1.5623 1.9390 3.3966 1.1983 13.9514 11.9550 2.2269 1.6923 2.8807 1.6970 5.6828 2.8305 2.4253 3.0787 3.6105 5.4732 3.5443 7.0764 0.2409 3.6324 6.8862 8.1922 0.0124 5.2562 3.3874 14.2611 171.8089 13.4333 5.6655 27.0953 3.8309 7.8726 0.3643 8.4985 14.4622 9.2226 51.3178 4.8655 20.8835 32.3401 6.3167 0.6968 5.8591 4.0885 13.8553 28.0928 2.3773 3.4538 3.7074 61.9897 35.4891 1.9355 54.2073 4.1640 0.2700 13.2576 9.3966 2.2730 24.2572 227.0878 33.8065 30.6902 19.4685 6.5108 0.1012 36.2009 16.9179 27.0840 27.5967 10.2596 1.1520 1.0675 38.7291 14.1872 1.9889 33.7395 8.6801 8.3842 300.1507 15.1319 19.3532 23.4194 44.5646 30.3854 3.1630 8.8783 108.0263 5.5663 8.2660 7.2828 46.2432 15.5747 7.8227 0.9087 12.7923 39.7177 75.4187 31.9452 58.1608 11.9255 16.0055 190.4439 1.1027 6.7870 32.9560 111.6291 37.4580 63.9905 65.7778 63.7749 76.5012 92.2022 49.7210 13.2713 38.7949 47.9759 35.4479 47.5315 8.0335 3.4283 19.6209 23.0561 14.4904 12.0714 43.1433 2.0054 19.2949 3.7470 15.7906
temp: 298.150 k
press: 1.00000 atm
elementType: 8 8 8 8 7 6 6 6 6 6 6 6 6 6 6 6 6 6 6 6 6 6 6 6 1 1 1 1 1 1 1 1 1 1 1 1 1 1 1 1 1 1 1 1 1 1 1
symmnumber: 1
zpe: 998712.2 jmol-1
zpe.correction: 0.380389 hartree
zpe.thermalcorrener: 0.405383 hartree
zpe.thermalcorrenthalpy: 0.406327 hartree
zpe.thermalcorrgfe: 0.320337 hartree
zpe.sumelectzpe: -1091.603323 hartree
zpe.sumelectthermal: -1091.578330 hartree
zpe.sumelectthermalent: -1091.577386 hartree
zpe.sumelectthermalfe: -1091.663376 hartree
dipole: -2.3145 0.0382 1.0992
dipole: 2.5625
quadrupole: -118.8295 -142.9207 -144.0153
quadrupole: -10.2490 3.8443 15.8712
quadrupole: 16.4256 -7.6655 -8.7601 -10.2490 3.8443 15.8712
hfenergy: -1091.9837128 hartree
pointgroup: C01 [X(C19H23N1O4)]
dipole: -0.8987961 -0.3224574 0.3234241 debye
polarizability: 311.1886193|36.1945241|186.5097835|-5.9670076|37.9604535|230.5534295 unknown
InChI: InChI=1S/C19H23NO4/c1-22-17-10-15(11-18(23-2)19(17)24-3)12-20-16(13-21)9-14-7-5-4-6-8-14/h4-8,10-12,16,21H,9,13H2,1-3H3
charge 0 multiplicity 1
47 atoms
O  2.155239 4.012826 1.163535
O  -3.443477 0.057369 2.238991
O  -3.151435 -0.781771 -2.589384
O  -4.663938 -0.861056 -0.084424
N  1.443102 1.345657 0.732888
C  2.868951 1.709644 0.563008
C  3.787019 0.527233 1.013441
C  3.778639 -0.640988 0.041723
C  3.120433 2.950872 1.448891
C  4.613184 -0.630608 -1.107296
C  2.911871 -1.746973 0.236355
C  -0.634647 0.484346 -0.22054
C  0.778411 0.897612 -0.301502
C  -1.290393 0.049769 -1.390959
C  -1.33782 0.519827 1.014209
C  -2.680635 0.110371 1.059405
C  -2.650308 -0.345422 -1.358027
C  -3.36517 -0.326039 -0.125696
C  4.583599 -1.695309 -2.03537
C  2.878113 -2.814602 -0.68952
C  3.713899 -2.792328 -1.829543
C  -2.760904 0.386607 3.494356
C  -4.591103 -0.704923 -2.894326
C  -5.744197 0.000594 0.445971
H  3.105641 1.960519 -0.49625
H  3.450516 0.203694 2.016266
H  4.813558 0.929887 1.121558
H  3.070473 2.647922 2.517617
H  4.112685 3.385532 1.241005
H  5.295142 0.213964 -1.270235
H  2.258026 -1.767601 1.116335
H  1.246952 0.806853 -1.304771
H  -0.771031 0.017034 -2.354221
H  -0.795101 0.851639 1.902873
H  5.238621 -1.672887 -2.913953
H  2.199992 -3.659115 -0.522947
H  3.689957 -3.619421 -2.547963
H  1.256825 3.589373 1.21945
H  -2.413954 1.437649 3.500364
H  -1.901516 -0.288491 3.66722
H  -3.517539 0.238282 4.278785
H  -4.647352 -0.871621 -3.981622
H  -5.155626 -1.476144 -2.348504
H  -4.996484 0.295495 -2.648409
H  -5.546899 0.267207 1.496079
H  -5.842595 0.916671 -0.169582
H  -6.658121 -0.607449 0.364817
