program: Gaussian 09
title: 000208927
version: EM64L-G09RevD.01
frameworkgroup: C1[X(C16H20ClNO5S)]
method: RPBEPBE
basis: SDD
operation: Freq
keyword: #p
keyword: freq=noraman
keyword: PBEPBE/SDD
title: #p freq=noraman PBEPBE/SDD
converged: YES YES NO NO
title: Mulliken charges:
elementType: Cl S O O O O O N C C C C C C C C C C C C C C C C H H H H H H H H H H H H H H H H H H H H
charge: -0.059329 0.234011 -0.330789 -0.181140 -0.441669 -0.210180 -0.283825 -0.398653 -0.019207 0.293429 -0.721144 -0.492484 -0.187121 -0.716119 -0.700575 0.185593 0.393305 0.267292 -0.324677 -0.365460 -0.777456 -0.212025 -0.180350 -0.120036 0.283917 0.329435 0.295720 0.249324 0.267132 0.246483 0.251063 0.251178 0.251939 0.242278 0.215291 0.341757 0.237838 0.264724 0.253775 0.253050 0.214591 0.254822 0.257987 0.386305
chargesum: 0.00000
title: Mulliken charges with hydrogens summed into heavy atoms:
elementType: Cl S O O O O O N C C C C C C C C C C C C C C C C
charge: -0.059329 0.234011 -0.330789 -0.181140 -0.055365 -0.210180 -0.283825 -0.056896 0.264710 0.293429 -0.095989 0.023972 -0.187121 0.032605 0.008933 0.185593 0.393305 0.267292 -0.086839 -0.100736 -0.056040 0.042797 0.077637 -0.120036
polarizability: 2.96693569e+02 9.90401425e+00 2.33366208e+02 1.22451489e+01 1.30570264e-02 1.53568144e+02
1716.lowfreq: -7.6213 -5.9962 -0.0013 -0.0010 0.0008 1.1547 5.7813 13.1182 22.9977
frequency: 3.9200 12.2833 22.9205 28.3403 34.0654 46.6829 54.5209 64.8559 72.7219 74.7513 80.3910 92.2410 127.9947 134.9354 143.8880 165.5017 184.1343 198.8706 221.5282 226.7478 231.8536 258.6816 277.6766 301.5038 313.5551 318.9963 340.2725 370.7991 403.4903 409.2250 412.7838 415.3698 427.5574 435.5385 490.3261 501.8224 519.6536 542.0880 563.2747 588.7112 606.3095 609.1256 621.1877 636.2374 647.4505 655.0327 674.2819 700.6502 701.7537 744.2488 805.3027 826.7876 831.9533 834.9327 860.8423 892.7878 914.9803 927.9492 932.6077 936.2887 954.5345 967.0039 976.0503 992.2811 994.1001 1000.6876 1039.3466 1043.8623 1070.7306 1081.6801 1104.2639 1133.6217 1157.4371 1168.2729 1175.9483 1189.5650 1209.6141 1211.7527 1218.7468 1264.8437 1275.3579 1284.9610 1290.6789 1306.2162 1325.7865 1353.7754 1362.7492 1377.0038 1388.1371 1392.6801 1399.4034 1421.4397 1450.3505 1450.8402 1457.5732 1462.0730 1466.2992 1467.1391 1473.0176 1482.2644 1493.0377 1581.6105 1597.5141 1602.6539 1611.1642 1683.8531 2982.3079 2997.2509 3001.4598 3003.5714 3025.2773 3034.8140 3098.1621 3101.4341 3104.2892 3106.9123 3108.6782 3110.9959 3115.2302 3120.7584 3160.4058 3161.7024 3179.2210 3186.2969 3512.1405 3525.0755
redmass: 6.8535 5.8073 5.2839 5.0096 9.6912 4.8015 5.7755 6.4467 3.7663 2.2942 2.0693 3.4325 4.9435 6.5623 6.1695 4.0893 1.4405 5.0684 1.2148 3.0181 5.3632 3.0411 3.6750 4.5350 3.4592 4.4348 4.7940 2.9459 4.3891 3.6042 5.0965 3.8973 2.2456 3.6000 3.4767 5.1197 3.5143 1.7688 2.2985 3.3378 5.2844 2.0724 1.9957 7.5816 5.1497 5.6691 4.1251 3.6779 3.6423 4.2893 1.2955 1.6121 3.6977 4.0703 2.6320 2.1351 3.2862 1.5079 1.3745 4.7837 1.3564 2.5655 2.4422 3.7980 1.6619 1.3013 2.0134 1.6860 2.6149 2.1935 1.3073 2.3519 2.3794 1.3616 2.5722 1.4271 1.2269 4.0499 2.5762 1.3328 1.8273 1.2586 1.6152 1.3943 1.6485 1.2915 5.8738 1.1958 1.2304 1.3596 2.8035 1.0932 1.0660 1.0986 1.0942 1.0641 1.1067 1.9738 1.0557 1.0998 1.8296 7.6391 6.7337 9.8918 5.6008 8.5922 1.0832 1.0359 1.0347 1.0352 1.0625 1.0589 1.0982 1.1006 1.1008 1.1002 1.1007 1.0996 1.1004 1.1057 1.0887 1.0893 1.0972 1.0956 1.0642 1.0790
irintensity: 0.3843 0.3944 0.9523 1.5292 4.4048 0.1703 0.4862 1.9141 5.5767 0.7274 6.6834 3.2880 0.2581 1.2728 0.5532 5.0227 1.5718 5.7706 0.2739 7.1220 0.2044 0.5941 1.2536 1.0135 1.2677 0.3521 10.6449 5.8294 9.2329 9.4932 9.8470 1.7278 0.5803 3.9963 12.6122 26.8192 22.5768 100.0444 48.6177 59.4804 10.4588 36.8920 42.1007 22.5061 9.6030 12.2418 1.4515 20.8659 45.8236 14.9255 14.3410 58.1723 14.6163 61.5269 2.8828 12.7186 43.4381 1.1633 1.5944 7.0768 5.0502 109.3995 131.3653 34.5107 1.3755 2.5036 77.5803 24.8814 52.0549 24.8416 9.6056 78.2836 149.4678 62.7674 36.9338 8.4077 9.5979 219.9545 1.3425 2.1473 90.1865 0.6327 11.6310 17.8771 69.7717 35.4932 1.9000 33.6834 61.9811 34.1211 8.2502 32.6973 39.1127 32.8464 17.1315 5.8175 50.0802 195.2127 32.7495 52.5626 262.8356 7.3512 16.6703 132.2527 151.2094 273.6665 5.9492 9.3765 10.9650 12.5671 5.1489 5.6346 9.5947 18.3449 7.5116 4.4983 18.0724 35.8628 1.5816 6.1608 3.5491 3.2119 3.9715 5.9389 29.7990 50.2427
temp: 298.150 k
press: 1.00000 atm
elementType: 17 16 8 8 8 8 8 7 6 6 6 6 6 6 6 6 6 6 6 6 6 6 6 6 1 1 1 1 1 1 1 1 1 1 1 1 1 1 1 1 1 1 1 1
symmnumber: 1
zpe: 882384.0 jmol-1
zpe.correction: 0.336082 hartree
zpe.thermalcorrener: 0.362753 hartree
zpe.thermalcorrenthalpy: 0.363697 hartree
zpe.thermalcorrgfe: 0.272666 hartree
zpe.sumelectzpe: -1908.904724 hartree
zpe.sumelectthermal: -1908.878053 hartree
zpe.sumelectthermalent: -1908.877109 hartree
zpe.sumelectthermalfe: -1908.968140 hartree
dipole: 1.2457 -1.0415 2.9746
dipole: 3.3889
quadrupole: -183.9318 -151.5743 -155.7685
quadrupole: -18.0631 -20.2246 7.9925
quadrupole: -20.1736 12.1839 7.9897 -18.0631 -20.2246 7.9925
hfenergy: -1909.2408064 hartree
pointgroup: C01[X(C16H20Cl1N1O5S1)]
dipole: -0.7467899 1.0181446 -0.4282305 debye
polarizability: 283.4000423|-0.5684342|156.8708218|-28.9367866|19.2884052|243.3570558 unknown
InChI: InChI=1S/C16H20ClNO5S/c1-10(19)18-12(8-14(20)21)9-24-15(22)16(2,3)23-13-6-4-11(17)5-7-13/h4-7,12,18,20H,8-9H2,1-3H3
charge 0 multiplicity 1
44 atoms
Cl -6.417171 0.250258 4.3307
S  0.819485 -1.064471 0.440126
O  -1.845566 -0.406906 0.447276
O  0.160059 -2.002126 -2.054842
O  3.615891 2.32243 -1.955811
O  4.409116 0.939449 -3.648662
O  5.075475 -1.243712 1.368667
N  3.817524 0.3156 0.199432
C  3.391044 -0.659462 -0.82299
C  -1.78715 -1.258468 -0.768219
C  2.448871 -1.742891 -0.246972
C  2.742722 0.076249 -2.027483
C  -0.268969 -1.49897 -0.990836
C  -2.429279 -2.649582 -0.548695
C  -2.350183 -0.514175 -1.999779
C  3.668557 1.093676 -2.657993
C  -2.974453 -0.319357 1.283159
C  4.666066 -0.04763 1.231689
C  -4.320933 -0.341451 0.841159
C  -2.682548 -0.112709 2.654415
C  5.070591 1.070918 2.185755
C  -5.368868 -0.17172 1.774301
C  -3.725603 0.067222 3.585454
C  -5.059423 0.02891 3.131753
H  4.293724 -1.207944 -1.163851
H  2.946612 -2.241426 0.599005
H  2.186633 -2.475872 -1.029041
H  1.822847 0.582758 -1.684309
H  2.470056 -0.672842 -2.786417
H  -2.007917 -3.132758 0.349721
H  -2.2170 -3.284873 -1.425171
H  -3.521762 -2.572758 -0.427273
H  -2.02694 -1.030607 -2.919364
H  -1.971143 0.521655 -2.023003
H  -3.452046 -0.48685 -1.984107
H  3.552031 1.29523 0.068977
H  -4.569842 -0.462585 -0.215324
H  -1.636007 -0.0965 2.971806
H  4.739516 0.813069 3.206641
H  6.171582 1.142517 2.209236
H  4.651246 2.054713 1.913362
H  -6.410283 -0.186638 1.440186
H  -3.502621 0.226042 4.644362
H  4.244664 2.969784 -2.37694
