program: Gaussian 09
title: 000208901
version: EM64L-G09RevD.01
frameworkgroup: C1[X(C20H24O7S)]
method: RPBEPBE
basis: SDD
operation: Freq
keyword: #p
keyword: freq=noraman
keyword: PBEPBE/SDD
title: #p freq=noraman PBEPBE/SDD
converged: YES YES NO NO
title: Mulliken charges:
elementType: S O O O O O O O C C C C C C C C C C C C C C C C C C C C H H H H H H H H H H H H H H H H H H H H H H H H
charge: 1.005181 -0.276107 -0.287541 -0.404564 -0.425298 -0.212085 -0.509406 -0.506994 -0.632018 -0.018732 0.484227 -0.578359 -0.276241 -0.345503 -0.439084 0.478623 0.371531 -0.391988 -0.350619 0.137409 -0.409815 -0.333083 -0.216113 0.304517 -0.322953 -0.334682 -0.685140 -0.743600 0.239261 0.239566 0.233419 0.239085 0.208439 0.222219 0.216083 0.261975 0.232717 0.243537 0.245040 0.235344 0.271525 0.225531 0.188114 0.255031 0.253745 0.233343 0.226470 0.206795 0.380393 0.289396 0.282585 0.288826
chargesum: 0.00000
title: Mulliken charges with hydrogens summed into heavy atoms:
elementType: S O O O O O O O C C C C C C C C C C C C C C C C C C C C
charge: 1.005181 -0.276107 -0.287541 -0.404564 -0.044905 -0.212085 -0.509406 -0.506994 -0.153191 0.214686 0.484227 -0.130835 0.162062 -0.083528 -0.206366 0.478623 0.371531 -0.148451 -0.105579 0.137409 -0.174471 -0.061558 0.197531 0.304517 -0.067922 -0.080937 -0.018533 0.117207
polarizability: 3.49551000e+02 -2.85855146e+01 3.27332225e+02 1.10959678e+01 1.26053279e+01 2.24667998e+02
1716.lowfreq: -6.2436 -4.1937 -0.0013 -0.0011 -0.0006 0.4096 3.4840 6.8038 13.5151
frequency: -4.5316 6.6886 12.8062 16.1562 27.4695 31.3118 36.7257 42.1454 46.4247 55.8566 63.5025 84.2119 101.4693 117.9388 120.9466 136.3548 145.8079 154.5565 164.0290 174.6949 188.0522 199.1194 226.3478 241.2245 249.2610 283.5860 286.8065 302.4055 320.4163 327.6434 347.1488 360.0618 383.5814 406.1818 412.5702 418.6102 423.6591 437.0746 451.5672 476.8878 496.2682 514.1032 551.6950 572.6300 579.9396 597.5448 616.9583 629.7433 634.0703 670.0764 708.4232 724.7550 737.3233 753.1736 794.5630 810.1058 814.5114 820.1286 822.8690 826.3796 831.2213 835.1513 860.4815 885.9497 892.0501 899.6478 913.7596 939.4018 964.0804 965.4106 972.7245 982.1301 983.3757 999.8289 1003.1274 1006.7436 1007.9745 1025.5247 1033.7510 1038.4426 1071.5684 1077.5749 1107.3335 1113.2550 1123.5118 1136.3211 1152.6788 1179.3884 1182.2053 1201.1808 1205.1072 1212.1774 1217.1185 1223.5240 1234.2218 1239.4324 1259.8679 1274.2692 1297.9112 1308.3264 1310.0076 1310.7530 1324.4505 1333.5561 1366.2534 1377.9833 1379.2539 1387.8167 1397.0197 1412.7062 1417.0243 1418.2741 1418.6632 1453.6249 1460.6712 1461.6458 1472.4751 1479.2236 1479.8762 1489.3170 1502.8074 1555.6170 1585.0738 1600.4016 1623.4346 1667.1346 2942.5130 2946.2494 2956.0755 2992.8869 2994.8102 3007.4321 3016.1634 3022.8253 3041.0251 3053.1856 3075.0479 3092.5967 3102.9759 3121.1724 3126.8412 3147.2164 3155.0306 3161.7685 3167.8947 3169.3479 3175.8731 3189.8598 3198.1651 3512.3389
redmass: 7.1100 6.4585 5.6652 5.4337 7.1932 4.5627 8.1340 4.3895 4.1982 4.3563 2.4573 4.4695 5.4040 4.6976 4.3167 1.1113 3.9879 3.5749 6.0422 3.6314 4.4235 3.9638 3.4102 1.5520 4.1482 5.7217 4.1474 3.0362 8.4856 4.3084 3.5612 4.3578 6.0571 3.1204 2.9390 3.6474 4.1929 3.3997 4.7664 4.5874 3.7246 2.9752 3.7150 2.6539 2.1437 3.6245 3.0407 6.3325 6.2619 3.2002 4.2047 3.6651 4.1780 3.2785 2.6485 1.5995 3.0393 1.1229 5.6688 7.9770 1.4904 1.3197 1.6733 3.2925 3.6040 3.2471 2.2722 1.4650 1.3605 1.3599 2.1494 1.3325 1.3928 2.9474 2.9568 2.7738 2.4997 1.8090 2.5930 2.8615 2.3641 4.5329 1.3695 1.7135 1.5539 1.4332 1.7646 1.2924 1.2258 1.3202 1.6950 2.0949 2.2755 3.6633 1.3498 1.2271 1.1503 1.4420 1.3380 1.2899 1.1334 1.3876 1.5065 1.6205 1.6642 2.7503 1.3292 3.1065 1.3077 1.0594 3.3280 3.2146 1.0525 1.1155 1.0434 1.1059 1.3236 1.1067 1.7317 1.0791 2.3559 6.6369 7.0256 6.0619 6.4386 9.1501 1.0673 1.0747 1.0559 1.0636 1.0358 1.0607 1.1016 1.1041 1.0246 1.1006 1.1013 1.0989 1.1014 1.0894 1.0897 1.0880 1.0884 1.0938 1.0954 1.0971 1.0974 1.1080 1.1073 1.0642
irintensity: 0.1069 0.7233 0.3054 4.0734 1.7782 0.6221 0.0516 2.0053 1.1637 2.3353 1.0908 6.8897 4.9631 1.5419 7.3879 0.0282 0.5916 6.0261 1.3815 2.2501 4.6357 11.9969 6.1948 0.8905 2.7046 7.6269 12.7007 0.1216 28.8309 5.8359 3.6378 23.8304 23.9263 2.2196 0.1565 2.4917 5.1113 1.6857 1.3080 11.4798 15.7353 1.0972 3.6028 128.6101 54.0408 48.2838 31.9814 3.3618 0.6943 37.2850 2.3700 0.8307 9.2442 6.6508 1.1043 28.9605 9.8530 4.1367 12.4189 39.3650 39.9878 2.2217 67.5495 33.1755 5.3365 29.0391 4.9551 0.7056 1.5024 1.1707 21.5722 46.5165 13.9932 30.6758 145.4479 41.0821 27.3154 47.9930 133.9914 68.4568 23.1576 57.2167 6.3400 21.9941 12.8652 7.2791 22.4271 81.3535 49.8085 0.3168 8.7258 135.3489 11.1255 101.3889 4.2642 15.9276 2.1541 24.8075 2.0379 10.2110 2.2077 10.3112 6.3999 4.3208 23.3409 0.3955 3.3208 17.3683 26.7864 15.4558 4.5554 2.7717 9.5140 12.5093 7.6293 16.8974 21.2899 9.9160 63.2993 4.4532 121.3306 1.4387 13.5350 84.9476 59.8074 239.0780 19.5550 55.7456 40.4163 16.6890 19.8349 22.5870 30.5266 63.5051 0.0683 17.5461 8.7508 33.6339 37.9055 18.8088 19.1347 7.7632 1.3147 17.2442 5.7158 3.4786 3.0517 0.0086 0.0145 21.0659
temp: 298.150 k
press: 1.00000 atm
elementType: 16 8 8 8 8 8 8 8 6 6 6 6 6 6 6 6 6 6 6 6 6 6 6 6 6 6 6 6 1 1 1 1 1 1 1 1 1 1 1 1 1 1 1 1 1 1 1 1 1 1 1 1
symmnumber: 1
zpe: 1057909.6 jmol-1
zpe.correction: 0.402936 hartree
zpe.thermalcorrener: 0.432249 hartree
zpe.thermalcorrenthalpy: 0.433193 hartree
zpe.thermalcorrgfe: 0.335984 hartree
zpe.sumelectzpe: -1698.875823 hartree
zpe.sumelectthermal: -1698.846510 hartree
zpe.sumelectthermalent: -1698.845566 hartree
zpe.sumelectthermalfe: -1698.942775 hartree
dipole: 2.1186 1.8023 0.6462
dipole: 2.8555
quadrupole: -155.9975 -154.9052 -171.4060
quadrupole: -7.8686 -23.7137 11.4053
quadrupole: 4.7721 5.8643 -10.6364 -7.8686 -23.7137 11.4053
hfenergy: -1699.2787592 hartree
pointgroup: C01[X(C20H24O7S1)]
dipole: 0.8348807 0.6827534 0.3145747 debye
polarizability: 339.0878458|-28.1431261|331.9828689|32.2995206|-3.2590546|230.4805076 unknown
InChI: InChI=1S/C20H24O7S/c1-3-25-19(20(21)22)14-16-6-8-17(9-7-16)26-13-12-15-4-10-18(11-5-15)27-28(2,23)24/h4-11,19,21H,3,12-14H2,1-2H3
charge 0 multiplicity 1
52 atoms
S  5.39669 -2.80898 2.005416
O  -4.767097 -1.43253 -1.149808
O  0.532298 2.36039 -0.56599
O  5.934505 -1.376235 0.671514
O  -7.00068 -0.367289 1.587794
O  -7.478202 -1.691161 -0.262726
O  5.525709 -2.257166 3.529853
O  4.042901 -3.579135 1.538992
C  -5.029469 0.832551 -0.329024
C  -5.202912 -0.67761 0.008488
C  -3.571131 1.258236 -0.376658
C  2.646062 3.309626 0.165533
C  1.162534 3.116531 0.52963
C  -2.739058 0.914169 -1.47731
C  -2.999063 1.998334 0.68482
C  3.501095 2.058942 0.307284
C  -0.830594 2.0308 -0.434672
C  -1.385806 1.29497 -1.510764
C  -1.639218 2.388188 0.67065
C  -6.664632 -0.992846 0.373422
C  4.547576 2.009812 1.269327
C  3.267501 0.915872 -0.50993
C  -4.568894 -2.877871 -0.899659
C  5.107218 -0.270005 0.587244
C  5.342535 0.858292 1.421916
C  4.050575 -0.242652 -0.36762
C  -3.950623 -3.469381 -2.164569
C  6.916982 -3.863817 1.573552
H  -5.523586 1.000501 -1.304384
H  -5.572479 1.417659 0.433472
H  -4.58622 -0.919938 0.902991
H  2.682136 3.688523 -0.874306
H  3.04863 4.109142 0.815469
H  1.055052 2.561597 1.483496
H  0.663644 4.103061 0.625911
H  -3.161922 0.332371 -2.302171
H  -3.622366 2.280225 1.542614
H  -0.742765 1.034026 -2.357296
H  -1.235376 2.96043 1.510896
H  4.736247 2.883291 1.904978
H  2.454248 0.946176 -1.24086
H  -5.546277 -3.34923 -0.674962
H  -3.894192 -3.007768 -0.025092
H  6.145493 0.809181 2.164225
H  3.874264 -1.130223 -0.983751
H  -4.620251 -3.313381 -3.027657
H  -2.979725 -2.992056 -2.382899
H  -3.78829 -4.555446 -2.039381
H  -7.948752 -0.571535 1.813273
H  6.830289 -4.087744 0.502866
H  6.858789 -4.760923 2.20517
H  7.788607 -3.236671 1.799096
