program: Gaussian 09
title: 000208900
version: EM64L-G09RevD.01
frameworkgroup: C1[X(C7H13N3O6)]
method: RPBEPBE
basis: SDD
operation: Freq
keyword: #p
keyword: freq=noraman
keyword: PBEPBE/SDD
title: #p freq=noraman PBEPBE/SDD
converged: YES YES NO NO
title: Mulliken charges:
elementType: O O O O O O N N N C C C C C C C H H H H H H H H H H H H H
charge: -0.241691 -0.413721 -0.425004 -0.459124 -0.247880 -0.229126 -0.399488 -0.160649 0.039605 -0.123124 -0.129276 -0.148205 -0.066329 -0.387343 0.349697 -0.620993 0.254694 0.212574 0.259636 0.258117 0.213662 0.260515 0.348206 0.347227 0.354725 0.355747 0.259021 0.261211 0.277316
chargesum: 0.00000
title: Mulliken charges with hydrogens summed into heavy atoms:
elementType: O O O O O O N N N C C C C C C C
charge: -0.241691 -0.066494 -0.070279 -0.103377 -0.247880 -0.229126 -0.051282 -0.160649 0.039605 0.131570 0.083297 0.111431 0.191788 0.086833 0.349697 0.176556
polarizability: 1.54500626e+02 -6.13090183e+00 9.96245786e+01 -4.51861954e+00 1.26178481e+01 1.10124631e+02
1716.lowfreq: -16.6169 -4.1600 -0.0008 -0.0006 0.0006 7.7162 32.8172 35.8152 50.9686
frequency: 32.3478 35.3905 50.9079 90.6001 101.1933 116.1094 135.8968 175.8149 192.5582 231.5541 237.8285 250.5760 280.2581 297.9279 317.0654 333.8949 362.4175 390.2397 391.5629 419.6009 441.2572 458.3218 481.5488 510.6686 560.0464 566.4237 620.6778 699.6781 720.5302 742.1400 755.2765 802.2620 828.1912 886.2427 888.2214 913.3413 948.2111 990.5310 1010.8231 1012.6507 1048.3953 1065.8449 1089.2265 1114.4688 1117.1147 1159.8755 1179.6812 1186.3897 1199.8842 1230.5659 1242.1411 1255.2827 1283.2587 1295.0040 1314.9905 1324.3260 1342.4573 1358.8671 1362.5159 1373.5191 1379.1679 1388.7267 1418.0187 1448.9549 1462.6186 1470.9753 1494.8317 1665.1650 2944.8250 2978.4434 3008.1074 3021.1191 3048.2200 3071.8978 3094.0834 3099.8893 3150.1808 3465.2150 3473.2302 3500.0683 3558.9298
redmass: 7.8311 5.2275 5.7567 6.6080 5.3346 6.3394 1.0913 6.8233 6.2293 2.7259 4.2481 2.3218 5.6636 2.9871 3.6891 4.5562 5.0842 4.0624 3.6322 4.3394 1.0972 7.0069 4.7679 4.4093 1.3860 2.5226 3.8450 2.0779 2.3297 4.7449 4.9751 4.1655 5.4589 2.8146 3.5084 3.1565 3.7637 2.8428 4.8883 3.6749 3.1821 3.6857 4.1904 1.9682 1.3275 1.7634 1.2382 1.7658 1.6413 1.3252 1.5755 1.4239 3.0299 1.4042 1.3320 1.3216 1.2895 1.3319 1.3601 5.0733 1.3290 1.3689 1.2076 1.0907 1.0430 1.0889 1.8350 9.4204 1.0833 1.0664 1.0336 1.0854 1.0852 1.0875 1.1011 1.0985 1.1011 1.0647 1.0771 1.0653 1.0662
irintensity: 0.2546 0.8622 0.8955 2.0162 10.8631 1.6714 0.7254 12.0775 1.2451 44.4848 3.3922 48.0910 21.1027 87.6778 17.9466 6.0722 13.7148 0.5566 5.2431 3.6381 40.4991 3.8458 14.2466 18.3962 204.5221 13.9278 20.6921 25.3293 75.8669 16.1011 48.8863 73.8819 22.5064 58.4607 31.0861 242.6420 95.5204 26.0275 83.6654 165.2600 32.7884 10.3406 35.4636 46.8535 0.5256 58.9494 69.5285 18.6600 68.5902 12.1898 23.5361 16.2476 30.9730 1.6044 7.5438 5.0460 5.4717 47.7633 71.8638 107.1908 12.7875 28.1432 46.1840 23.3827 22.8903 26.2895 561.4650 207.6568 32.2607 38.3761 11.1919 8.2270 14.0226 30.4522 10.8471 15.8186 0.2415 23.7937 53.7305 11.4714 6.0370
temp: 298.150 k
press: 1.00000 atm
elementType: 8 8 8 8 8 8 7 7 7 6 6 6 6 6 6 6 1 1 1 1 1 1 1 1 1 1 1 1 1
symmnumber: 1
zpe: 579993.0 jmol-1
zpe.correction: 0.220908 hartree
zpe.thermalcorrener: 0.237507 hartree
zpe.thermalcorrenthalpy: 0.238451 hartree
zpe.thermalcorrgfe: 0.176015 hartree
zpe.sumelectzpe: -888.795608 hartree
zpe.sumelectthermal: -888.779009 hartree
zpe.sumelectthermalent: -888.778065 hartree
zpe.sumelectthermalfe: -888.840500 hartree
dipole: -1.8660 -1.9858 0.1221
dipole: 2.7277
quadrupole: -100.5864 -96.8599 -102.2164
quadrupole: -9.2238 6.8032 1.8414
quadrupole: -0.6988 3.0277 -2.3289 -9.2238 6.8032 1.8414
hfenergy: -889.0165155 hartree
pointgroup: C01 [X(C7H13N3O6)]
dipole: -0.7408511 -0.4913715 -0.6011431 debye
polarizability: 154.5737921|-1.3081519|94.2586224|-7.5339841|-8.4111789|115.4174209 unknown
InChI: InChI=1S/C7H13N3O6/c1-10(9-15)7(14)8-6-5(13)4(12)3(11)2-16-6/h3-6,8,11-13H,2H2,1H3
charge 0 multiplicity 1
29 atoms
O  0.960623 -1.190002 -0.774275
O  1.270117 2.208571 0.826652
O  3.950632 0.941826 1.258954
O  3.427225 -1.699369 0.644323
O  -1.876211 0.83036 -1.816359
O  -4.211279 -0.720007 1.825641
N  -0.785252 0.118213 0.143812
N  -3.153356 0.072024 0.008044
N  -3.077597 -0.46848 1.296114
C  3.015453 0.682436 0.169405
C  1.544892 0.784474 0.649094
C  3.333542 -0.704241 -0.45062
C  0.553714 0.190881 -0.390679
C  2.270527 -1.139997 -1.464777
C  -1.892694 0.368784 -0.648684
C  -4.440073 0.314848 -0.665015
H  3.185386 1.484014 -0.572098
H  1.439976 0.223642 1.605842
H  4.340704 -0.67928 -0.898979
H  0.532899 0.831177 -1.294953
H  2.2230 -0.446128 -2.329394
H  2.453123 -2.165853 -1.821163
H  -0.956324 -0.337708 1.047723
H  0.393212 2.321433 1.274272
H  4.078333 0.068224 1.722996
H  2.50723 -2.041046 0.80897
H  -5.050045 1.015106 -0.069176
H  -4.998257 -0.632059 -0.762127
H  -4.220399 0.73666 -1.655545
