program: Gaussian 09
title: 000208899
version: EM64L-G09RevD.01
frameworkgroup: C1[X(C16H24N2O2)]
method: RPBEPBE
basis: SDD
operation: Freq
keyword: #p
keyword: freq=noraman
keyword: PBEPBE/SDD
title: #p freq=noraman PBEPBE/SDD
converged: YES YES NO NO
title: Mulliken charges:
elementType: O O N N C C C C C C C C C C C C C C C C H H H H H H H H H H H H H H H H H H H H H H H H
charge: -0.442446 -0.271285 -0.153203 -0.268111 -0.041526 -0.163433 -0.389738 -0.429635 -0.443093 -0.762014 0.118785 -0.320435 0.297458 -0.645214 0.333743 -0.348798 -0.341559 -0.827495 -0.259934 -0.244028 0.230642 0.272396 0.196376 0.193153 0.196386 0.223298 0.254077 0.202366 0.225855 0.223773 0.208677 0.204037 0.210602 0.229331 0.231804 0.277812 0.353156 0.246464 0.234119 0.244183 0.247987 0.229584 0.234493 0.231388
chargesum: 0.00000
title: Mulliken charges with hydrogens summed into heavy atoms:
elementType: O O N N C C C C C C C C C C C C C C C C
charge: -0.089290 -0.271285 -0.153203 -0.268111 0.189116 0.108964 -0.000210 -0.009950 0.013350 -0.103709 0.118785 0.094205 0.297458 0.093733 0.333743 -0.102334 -0.107439 -0.105741 -0.025441 -0.012640
polarizability: 2.10730096e+02 -2.07687749e+01 1.81405147e+02 -8.25355157e+00 -1.14054298e+01 1.65958853e+02
1716.lowfreq: -8.8062 -6.5039 0.0001 0.0002 0.0008 6.7941 17.3072 46.1203 53.5843
frequency: 15.3889 46.0399 53.5063 69.3826 92.6087 98.6732 110.7859 116.0729 129.0784 137.6639 152.3893 171.3995 220.5914 231.3175 234.4651 280.0143 281.0077 296.0088 314.7919 319.0069 348.4796 386.0524 392.9580 408.7539 442.0239 455.6438 471.6641 480.3965 490.2952 551.3098 554.8493 564.1702 594.2132 626.5809 666.4921 727.2936 748.5442 771.2824 774.3617 799.2133 817.8265 842.1371 855.7002 867.7383 904.3295 925.7649 946.3435 953.2268 962.3690 976.1477 977.1942 985.8985 1013.8330 1032.0577 1039.2527 1042.8048 1044.7244 1080.5171 1098.5913 1100.3579 1111.1951 1119.6277 1127.9722 1132.9383 1156.3831 1171.0259 1189.3389 1197.1093 1206.9007 1221.5482 1253.7379 1258.8979 1276.4705 1282.4750 1306.4012 1312.4273 1330.1581 1336.3384 1340.6385 1346.0974 1366.0012 1369.5516 1375.1474 1387.6728 1394.9988 1395.2059 1409.9187 1434.7851 1453.2831 1462.3944 1466.1093 1471.9539 1473.4932 1478.0908 1479.1405 1480.8151 1483.9822 1489.9240 1492.0808 1570.2833 1582.6223 1610.0113 2948.2875 2958.3306 2971.5331 2975.5939 2978.1940 2978.3851 2979.0819 2994.9401 3007.5497 3024.0428 3027.7741 3051.3435 3056.8411 3058.7409 3066.8858 3072.1873 3080.4330 3097.9738 3113.5024 3123.6089 3135.4488 3151.1050 3166.8918 3519.4156
redmass: 4.6339 3.9191 4.5383 4.5300 4.1973 3.5844 1.6077 1.7068 1.7034 1.5212 3.1990 3.6782 1.9208 1.5024 2.4768 2.9074 2.5285 2.9144 2.0231 2.9839 3.1802 2.4121 4.4256 4.3211 2.4744 2.9063 3.4614 2.5858 2.2305 5.5073 2.8882 3.1801 2.6954 4.1889 5.9708 2.4333 3.4397 2.7540 1.8657 3.3885 2.2093 2.8988 1.7829 1.3329 2.4980 2.1272 1.3809 3.8736 2.0037 1.5953 1.4030 1.3203 1.8875 2.9947 2.2318 1.8950 2.0723 1.9658 1.8808 1.7585 1.9076 1.3673 1.9617 1.7596 2.0200 1.0583 1.6318 1.4116 2.4474 1.6020 1.8062 1.9537 1.5315 1.4577 1.2937 1.3138 1.6667 1.4112 1.4276 1.5608 3.2339 3.7654 1.3021 1.2536 1.1844 1.2334 1.2311 2.1726 1.0907 1.0880 1.1944 1.0515 1.1345 1.0698 1.0855 1.0695 1.1720 1.7743 1.0732 6.7937 6.2375 6.5185 1.0631 1.0658 1.0782 1.0346 1.0409 1.0394 1.0616 1.0644 1.0820 1.0996 1.0979 1.0962 1.1013 1.0932 1.1008 1.0988 1.0990 1.0991 1.0989 1.0870 1.0886 1.0942 1.1007 1.0650
irintensity: 1.3070 0.7462 1.8511 0.0957 1.3668 4.0775 1.6694 1.5748 0.5251 0.2609 1.3448 1.5569 0.0761 0.9354 1.9515 0.7422 0.6175 0.6259 2.4435 5.5998 2.3634 20.5913 1.9476 18.4270 21.3839 11.5628 6.8538 10.0044 77.6552 2.7720 15.3892 7.6817 6.6468 5.2398 5.6184 23.4213 11.6139 32.2745 29.9315 1.6271 20.5193 8.8925 2.3025 0.7577 3.6732 17.0336 0.8929 71.0826 34.8228 2.2670 1.0277 0.4314 25.1661 6.6359 6.6360 20.2516 7.1510 21.6969 63.0746 9.6897 35.0251 4.5628 9.5651 36.6665 37.8554 0.4021 4.0843 2.2775 2.1708 38.9983 41.6098 12.7967 2.1947 5.1053 0.7012 9.2961 20.0214 13.7834 3.7784 13.6286 23.9154 20.4039 1.7657 20.5360 24.4376 14.4181 39.4238 11.6079 13.4899 9.7790 7.0853 12.4567 24.3714 27.9663 16.0353 1.7268 14.4344 58.6993 5.0314 243.4293 7.3902 4.5556 47.9621 42.9721 31.8840 57.2794 10.0498 41.8541 26.6989 68.6547 14.1250 43.3269 53.1538 21.5443 23.6266 23.0715 20.4462 53.6666 34.2754 12.3165 1.4980 5.7830 6.4125 26.0176 17.0473 42.9331
temp: 298.150 k
press: 1.00000 atm
elementType: 8 8 7 7 6 6 6 6 6 6 6 6 6 6 6 6 6 6 6 6 1 1 1 1 1 1 1 1 1 1 1 1 1 1 1 1 1 1 1 1 1 1 1 1
symmnumber: 1
zpe: 983538.7 jmol-1
zpe.correction: 0.374610 hartree
zpe.thermalcorrener: 0.395266 hartree
zpe.thermalcorrenthalpy: 0.396210 hartree
zpe.thermalcorrgfe: 0.325179 hartree
zpe.sumelectzpe: -882.506946 hartree
zpe.sumelectthermal: -882.486290 hartree
zpe.sumelectthermalent: -882.485346 hartree
zpe.sumelectthermalfe: -882.556377 hartree
dipole: 1.6329 -1.3217 1.0787
dipole: 2.3615
quadrupole: -113.0728 -126.5608 -117.5437
quadrupole: 6.8894 0.1486 -7.0801
quadrupole: 5.9863 -7.5016 1.5154 6.8894 0.1486 -7.0801
hfenergy: -882.8815558 hartree
pointgroup: C01 [X(C16H24N2O2)]
dipole: -0.598907 -0.5274699 -0.4757195 debye
polarizability: 209.2053152|22.0260868|182.2746867|-6.0122223|12.7016375|166.6140939 unknown
InChI: InChI=1S/C16H24N2O2/c1-12-7-4-5-9-14(12)17(3)16(20)15-10-6-8-13(2)18(15)11-19/h4-5,7,9,13,15,19H,6,8,10-11H2,1-3H3
charge 0 multiplicity 1
44 atoms
O  -0.223781 -2.229366 1.385342
O  1.242352 2.645523 -0.246384
N  1.288435 -0.786259 0.17176
N  -0.671415 1.415094 -0.706007
C  2.505685 -0.67586 -0.699821
C  1.017412 0.48166 0.923999
C  3.769831 -0.338694 0.138741
C  2.245108 0.938533 1.762515
C  3.557406 0.970905 0.938714
C  2.700086 -1.907852 -1.603908
C  0.547665 1.597487 -0.04646
C  1.172988 -1.979821 1.021016
C  -1.605829 0.333991 -0.465814
C  -1.110048 2.432196 -1.688611
C  -2.483482 0.367772 0.654457
C  -1.699228 -0.705876 -1.424654
C  -3.429139 -0.683644 0.789525
C  -2.418046 1.465749 1.699268
C  -2.651445 -1.73554 -1.277174
C  -3.519484 -1.724923 -0.157105
H  2.307917 0.192224 -1.362305
H  0.178852 0.245188 1.607187
H  4.64667 -0.23637 -0.530754
H  3.984131 -1.185374 0.824742
H  2.357395 0.233111 2.61074
H  2.048464 1.938182 2.190111
H  3.509033 1.823917 0.23835
H  4.41539 1.145694 1.616145
H  1.74344 -2.20453 -2.071761
H  3.417306 -1.664942 -2.408613
H  3.108209 -2.777431 -1.056501
H  1.673238 -1.900276 2.009309
H  1.603818 -2.836806 0.470878
H  -2.04868 2.914081 -1.356116
H  -1.286291 1.964354 -2.674175
H  -0.316481 3.191123 -1.769193
H  -0.768091 -2.174317 0.555611
H  -1.003511 -0.702006 -2.270188
H  -4.10313 -0.678589 1.654576
H  -1.852417 1.127962 2.589741
H  -1.918832 2.371027 1.316127
H  -3.429421 1.742606 2.045175
H  -2.715365 -2.536913 -2.021036
H  -4.260319 -2.521296 -0.02745
