program: Gaussian 09
title: 000208897
version: EM64L-G09RevD.01
frameworkgroup: C1[X(C10H10N4O3)]
method: RPBEPBE
basis: SDD
operation: Freq
keyword: #p
keyword: freq=noraman
keyword: PBEPBE/SDD
title: #p freq=noraman PBEPBE/SDD
converged: YES YES NO NO
title: Mulliken charges:
elementType: O O O N N N N C C C C C C C C C C H H H H H H H H H H
charge: -0.361200 -0.388257 -0.351415 -0.190726 -0.198568 -0.035917 -0.348109 0.255890 0.247763 0.297451 0.127223 -0.382785 -0.367735 -0.794490 -0.235085 -0.207813 0.064212 0.269396 0.291900 0.253262 0.311668 0.258622 0.234434 0.234549 0.368015 0.375678 0.272038
chargesum: 0.00000
title: Mulliken charges with hydrogens summed into heavy atoms:
elementType: O O O N N N N C C C C C C C C C C
charge: 0.006814 -0.012579 -0.351415 -0.190726 -0.198568 -0.035917 -0.076071 0.255890 0.247763 0.297451 0.127223 -0.113389 -0.075835 0.029062 -0.000651 0.026735 0.064212
polarizability: 3.55624366e+02 6.38467760e+00 1.76727180e+02 1.31508858e+01 2.26001377e+00 7.81365716e+01
1716.lowfreq: -9.7035 -6.9962 -0.0006 -0.0004 0.0005 2.4493 31.8265 71.5179 75.8816
frequency: 31.8059 71.4972 75.8772 87.3863 116.5449 156.3420 199.6577 206.6624 212.1123 222.1794 264.0735 283.0853 290.8186 312.5882 352.6332 380.1424 390.1493 422.4694 446.4131 458.1549 472.5495 523.5872 538.8388 554.6581 584.0840 624.9901 643.6223 669.2714 698.7689 751.8660 775.8639 796.8938 834.7260 860.1901 915.4941 927.6183 948.7365 973.8741 1008.8423 1030.6561 1033.7929 1046.9177 1054.9974 1106.4478 1163.7908 1174.7806 1221.4824 1262.9788 1275.2141 1293.9892 1304.3344 1319.2220 1331.4943 1384.3343 1404.5004 1420.0206 1443.3781 1449.3094 1466.3966 1480.5947 1484.9772 1532.5101 1585.8972 1601.7350 1605.2593 2310.5923 2815.1452 3008.1573 3115.2568 3144.8190 3163.2377 3181.1924 3185.8175 3201.5200 3364.0452
redmass: 7.0308 3.9817 4.9275 4.5711 6.4158 3.6221 4.6696 4.2711 1.9001 1.1761 4.4734 6.6562 5.7735 5.8658 7.6634 3.8064 4.0865 6.7758 5.9225 3.9400 6.5078 5.8188 4.2128 6.2950 5.7452 6.5758 5.7786 6.8740 4.7157 1.2160 2.9497 3.0236 2.6754 1.3380 1.1292 1.3508 7.6838 1.3072 7.4857 2.1871 1.4979 3.2478 2.0505 1.9548 1.4508 1.5621 3.4592 4.6334 1.8528 1.8302 3.4983 1.6534 3.9139 2.9048 5.5845 1.1819 1.8236 2.3671 2.3898 1.2109 2.0191 2.7744 3.9096 7.4086 2.0923 1.0836 1.0683 1.0740 1.0933 1.0867 1.0920 1.0968 1.0748 1.0946 1.0687
irintensity: 0.5333 11.8541 2.3024 9.1031 4.0634 16.6655 5.4315 13.4467 37.9231 50.0720 4.9836 4.7533 2.8633 8.4542 3.9117 12.3156 19.5132 1.6380 5.0653 6.5457 5.5004 3.1535 1.6114 6.3754 9.0520 9.6418 1.9313 7.6422 0.4736 107.8802 31.7119 22.4886 5.3833 0.7014 138.4393 16.9946 13.6237 0.6462 23.7989 10.4197 7.7697 8.5531 15.0216 14.3673 12.9570 9.1007 10.7826 9.0614 101.2395 447.5570 58.3913 207.3422 382.0551 41.1779 54.2318 33.2155 354.5103 1.7648 52.4578 76.0233 73.0695 72.2353 160.6172 11.8041 16.4741 49.7175 25.7063 2.4506 3.3654 6.2677 19.8811 8.9172 7.9317 0.6285 1.8787
temp: 298.150 k
press: 1.00000 atm
elementType: 8 8 8 7 7 7 7 6 6 6 6 6 6 6 6 6 6 1 1 1 1 1 1 1 1 1 1
symmnumber: 1
zpe: 502753.7 jmol-1
zpe.correction: 0.191489 hartree
zpe.thermalcorrener: 0.207081 hartree
zpe.thermalcorrenthalpy: 0.208026 hartree
zpe.thermalcorrgfe: 0.148727 hartree
zpe.sumelectzpe: -830.331293 hartree
zpe.sumelectthermal: -830.315700 hartree
zpe.sumelectthermalent: -830.314756 hartree
zpe.sumelectthermalfe: -830.374055 hartree
dipole: -3.3411 5.2213 -0.5852
dipole: 6.2264
quadrupole: -94.0151 -98.6451 -97.6461
quadrupole: 7.6322 7.0326 -5.9227
quadrupole: 2.7537 -1.8764 -0.8773 7.6322 7.0326 -5.9227
hfenergy: -830.5227814 hartree
pointgroup: C01 [X(C10H10N4O3)]
dipole: -1.3872433 2.0184708 -0.0461234 debye
polarizability: 353.6289191|10.777533|175.4975647|23.7499211|14.3386556|81.3616346 unknown
InChI: InChI=1S/C10H10N4O3/c1-6-9(10(15)12-11)14(17)8-5-3-2-4-7(8)13(6)16/h2-5,11,16-17H,1H3
charge 0 multiplicity 1
27 atoms
O  -0.95952 2.864055 -0.07781
O  0.342604 -2.532034 -0.450202
O  2.66564 -1.84395 -0.90582
N  -0.589285 1.47666 -0.007634
N  0.048436 -1.13848 -0.34651
N  3.462256 -0.435824 0.747082
N  4.056509 0.714178 0.916558
C  -1.662728 0.534183 0.018254
C  -1.304718 -0.834655 -0.1816
C  0.764195 1.158958 -0.006864
C  1.108533 -0.202965 -0.122562
C  -3.001778 0.915542 0.201497
C  -2.319134 -1.818209 -0.206006
C  1.741415 2.291697 0.044452
C  -4.016592 -0.075783 0.164312
C  -3.669449 -1.428395 -0.042755
C  2.469269 -0.767764 -0.179581
H  -3.244744 1.965453 0.38372
H  -2.032171 -2.86026 -0.355317
H  2.034333 2.596249 -0.979647
H  2.696595 1.97926 0.52868
H  1.302029 3.163774 0.550244
H  -5.062177 0.214919 0.302928
H  -4.45111 -2.194696 -0.071837
H  -1.252537 3.023472 -1.024173
H  1.339586 -2.508911 -0.838822
H  4.684243 0.617121 1.752716
