program: Gaussian 09
title: 000208896
version: EM64L-G09RevD.01
frameworkgroup: C1[X(C20H29N5O4)]
method: RPBEPBE
basis: SDD
operation: Freq
keyword: #p
keyword: freq=noraman
keyword: PBEPBE/SDD
title: #p freq=noraman PBEPBE/SDD
converged: YES YES NO NO
title: Mulliken charges:
elementType: O O O O N N N N N C C C C C C C C C C C C C C C C C C C C H H H H H H H H H H H H H H H H H H H H H H H H H H H H H
charge: -0.489632 -0.293430 -0.317017 -0.292371 -0.402295 -0.117182 -0.138831 -0.401591 -0.011797 -0.423160 -0.343149 -0.589773 -0.043365 0.600800 -0.302792 -0.525863 -0.461896 0.202972 -0.336254 0.175563 0.200212 -0.303647 -0.554441 -0.529512 -0.246121 0.184359 0.180746 -0.767070 -0.793211 0.223917 0.221422 0.226621 0.209179 0.208715 0.225854 0.204499 0.281797 0.253171 0.230811 0.248932 0.229759 0.246762 0.392807 0.257691 0.283782 0.231806 0.220870 0.225472 0.215698 0.263685 0.285168 0.316161 0.226719 0.249135 0.227005 0.241361 0.241604 0.249345
chargesum: 0.00000
title: Mulliken charges with hydrogens summed into heavy atoms:
elementType: O O O O N N N N N C C C C C C C C C C C C C C C C C C C C
charge: -0.096824 -0.293430 -0.317017 -0.292371 -0.120498 -0.117182 -0.138831 -0.085430 -0.011797 0.022180 0.092651 -0.155204 0.161134 0.600800 0.181190 -0.276930 -0.232137 0.202972 -0.089492 0.175563 0.200212 -0.045957 0.182017 0.175342 0.039047 0.184359 0.180746 -0.064211 -0.060901
polarizability: 4.30889669e+02 8.55900625e+00 2.73594465e+02 -2.16605207e+01 1.11599260e+01 1.81245712e+02
1716.lowfreq: -4.0543 -0.0010 0.0008 0.0015 1.1948 7.1096 7.6949 15.0920 16.4651
frequency: 7.2686 15.0593 16.3471 25.6505 29.1415 50.1962 55.5555 59.1963 65.6000 71.4703 80.2629 93.5849 101.4573 118.2937 122.9164 139.4682 145.1443 158.8384 174.5641 186.6925 189.0238 190.3022 219.6776 221.6487 228.6925 260.6939 285.0512 290.5994 299.9439 304.5913 319.2682 328.1747 335.2948 352.0065 377.3698 391.8064 409.8720 433.6722 435.1306 476.0943 482.1182 490.8732 499.4211 516.7316 523.3744 549.0185 566.7107 591.2535 608.7135 619.9701 628.1883 635.2523 667.3361 690.0666 715.2859 740.0983 746.6406 771.9197 790.5908 807.8518 809.2218 827.4366 841.7825 852.9754 858.5518 863.9023 892.8466 918.2491 939.4552 944.9082 947.1849 958.9794 959.9139 962.4035 969.9524 977.4798 982.6828 1014.4878 1018.4824 1032.4434 1048.9202 1075.9547 1083.2366 1090.0786 1099.4239 1109.3133 1113.4686 1122.0180 1130.5567 1132.1188 1142.7826 1155.6359 1158.1624 1163.6215 1183.1160 1202.8350 1208.6787 1217.5121 1246.5393 1247.3682 1249.3582 1254.2935 1258.2611 1278.3811 1292.3413 1295.8412 1326.6417 1330.6996 1341.3180 1355.8574 1362.9835 1369.9243 1381.7472 1383.9726 1397.8082 1402.9356 1423.0076 1425.2828 1439.9430 1445.3133 1449.8447 1457.3635 1457.4524 1460.3863 1466.0034 1466.2179 1469.7415 1473.7814 1476.1340 1485.4008 1488.1410 1490.9158 1492.6747 1508.3448 1532.2213 1574.0110 1594.7425 1613.4442 1615.4584 2903.2671 2941.7189 2955.8193 2962.6085 2963.7363 2966.4173 2969.4954 2971.5870 3011.4054 3016.4913 3026.6380 3032.9853 3037.5869 3049.7229 3063.3370 3073.8478 3089.7110 3103.7321 3109.7616 3115.7613 3122.0012 3122.2653 3133.4445 3143.1118 3160.9690 3169.5723 3195.1857 3447.7859 3481.5961
redmass: 5.2889 5.5079 4.0589 5.4755 4.8776 4.8307 3.1968 3.3336 3.7545 4.3909 4.0149 4.2841 3.6789 3.2385 5.0409 1.7074 2.0586 2.5487 1.3982 2.2149 1.5015 1.7900 1.5067 2.4294 2.9378 3.1791 3.9337 2.4694 3.2505 3.3530 4.9561 3.4053 4.1864 3.9387 3.9183 3.6775 9.0616 3.2882 3.1757 2.1180 4.0774 3.3558 3.8086 3.4328 3.3361 4.3168 4.8417 2.9107 1.4805 2.5857 4.7041 4.9598 2.3957 4.4774 5.1024 6.9171 2.8122 1.4012 3.6138 3.0393 2.3861 1.7545 1.5389 2.3898 4.1493 2.9027 1.5761 1.5928 3.6791 7.6657 1.5896 4.2938 1.2624 1.4150 3.7631 1.3114 2.5316 2.5562 2.6280 1.9739 3.4662 1.6185 1.9126 1.9043 2.2532 2.0735 1.2400 1.2359 2.3306 2.1234 1.9011 1.3191 1.4624 1.0898 4.8576 1.8291 1.3762 1.1843 2.6869 2.1169 3.1615 1.5603 1.5122 3.7572 1.1574 1.2170 1.6029 1.4708 1.5096 1.4574 2.2842 4.1255 2.7108 1.2763 1.3469 2.2022 1.3342 1.4660 1.2245 1.2834 1.2046 1.0928 1.0650 1.0476 1.1150 1.1095 1.0699 1.0852 1.0456 1.2979 1.4910 1.1788 1.1416 1.7707 5.0771 7.2938 6.5851 6.7127 6.6085 1.0708 1.0832 1.0398 1.0346 1.0590 1.0383 1.0597 1.0335 1.0962 1.0580 1.0972 1.0931 1.0972 1.1001 1.1064 1.1010 1.1076 1.0960 1.0970 1.1022 1.1015 1.0913 1.0640 1.0906 1.0951 1.0903 1.0983 1.0742 1.0758
irintensity: 0.5112 0.2193 0.0724 0.1577 0.7174 0.2071 7.1568 5.3627 1.8600 2.6435 3.3221 2.3005 6.1687 0.7892 1.5339 0.5002 4.9671 3.0716 0.9914 5.2765 2.5968 3.5349 2.0075 1.2221 10.3974 1.9243 10.3307 0.9132 16.4607 3.0398 23.0721 11.2520 1.1412 4.4339 0.3762 11.4624 0.4316 0.4977 2.3400 16.8575 1.9859 9.3737 12.6193 18.5744 2.4353 12.1090 4.6949 24.8304 77.8610 31.6268 13.1727 28.3137 47.8282 5.4993 10.9167 0.0094 7.5011 54.7785 32.1577 9.4385 17.5596 20.1625 44.8873 9.0077 11.7953 18.3401 3.9781 6.9029 39.9574 237.6785 24.6392 41.3067 0.0026 6.4943 41.6651 0.4031 29.9266 31.0748 15.6925 24.5120 46.5144 4.7175 35.0020 15.6360 75.4610 17.3015 15.2807 0.4414 204.7968 13.8271 18.0697 0.6366 2.2673 9.7971 8.0627 52.9612 3.7768 28.7661 103.8639 246.3750 34.4219 15.0477 32.1012 59.3927 10.9949 2.8512 6.9110 111.9934 28.1708 32.0411 251.0058 1.7004 5.3735 66.9357 2.9997 10.8780 12.1789 37.8703 16.8374 8.8032 189.4629 9.7995 11.3489 20.2925 25.4201 63.6175 5.2238 13.7194 12.7328 73.8665 53.4919 8.2420 44.9062 248.2039 164.0805 5.3018 47.7486 46.9018 2.3180 88.9112 40.0683 18.1697 61.8558 57.7194 54.9186 69.2183 89.5557 7.3489 16.8467 16.9027 35.3052 24.9438 29.8244 11.8352 26.3849 22.8570 12.8294 21.1483 22.8367 24.8586 9.5345 234.6902 25.1747 9.0116 4.1981 1.1909 9.5668 1.1937
temp: 298.150 k
press: 1.00000 atm
elementType: 8 8 8 8 7 7 7 7 7 6 6 6 6 6 6 6 6 6 6 6 6 6 6 6 6 6 6 6 6 1 1 1 1 1 1 1 1 1 1 1 1 1 1 1 1 1 1 1 1 1 1 1 1 1 1 1 1 1
symmnumber: 1
zpe: 1238981.1 jmol-1
zpe.correction: 0.471903 hartree
zpe.thermalcorrener: 0.502985 hartree
zpe.thermalcorrenthalpy: 0.503929 hartree
zpe.thermalcorrgfe: 0.404468 hartree
zpe.sumelectzpe: -1351.854626 hartree
zpe.sumelectthermal: -1351.823544 hartree
zpe.sumelectthermalent: -1351.822600 hartree
zpe.sumelectthermalfe: -1351.922061 hartree
dipole: 4.1257 -3.5914 -0.3141
dipole: 5.4789
quadrupole: -122.2389 -155.8148 -174.4609
quadrupole: 14.7539 0.1019 -3.5672
quadrupole: 28.5993 -4.9766 -23.6227 14.7539 0.1019 -3.5672
hfenergy: -1352.3265294 hartree
pointgroup: C01 [X(C20H29N5O4)]
dipole: 0.3269796 -1.9705147 0.8103039 debye
polarizability: 310.1045818|85.1461453|367.2986231|16.8712731|-50.8019296|208.3266406 unknown
InChI: InChI=1S/C20H29N5O4/c1-14(2)22-23-19-7-8-20(25-24-19)29-13-16(26)12-21-10-9-15-5-6-17(27-3)18(11-15)28-4/h5-8,11,16,21,23,26H,9-10,12-13H2,1-4H3
charge 0 multiplicity 1
58 atoms
O  0.642519 1.819816 -0.507479
O  -0.230343 -1.505874 0.821912
O  0.31978 5.836343 0.054393
O  1.769469 7.117385 -2.146376
N  3.135906 1.23823 0.122766
N  -2.07711 -2.40621 -0.349393
N  -3.018102 -3.395827 -0.515071
N  -4.011997 -5.404664 0.086665
N  -4.12333 -6.536596 0.879072
C  2.209039 0.083148 0.215843
C  3.536015 1.866847 1.402087
C  4.376265 3.145981 1.171452
C  0.755543 0.638629 0.347754
C  3.681933 4.212009 0.329109
C  -0.313325 -0.351412 -0.114993
C  2.340178 4.587525 0.583461
C  4.358615 4.843741 -0.74451
C  1.680253 5.542206 -0.214791
C  3.71974 5.829698 -1.528428
C  2.377946 6.190596 -1.275139
C  -1.170288 -2.512107 0.658168
C  -1.126351 -3.607516 1.570265
C  -0.613559 5.091987 -0.835603
C  1.137109 8.294006 -1.506124
C  -2.074494 -4.615643 1.411915
C  -3.014267 -4.465927 0.343891
C  -5.086274 -7.397141 0.606748
C  -5.180213 -8.620244 1.487703
C  -6.087952 -7.226584 -0.525057
H  2.285516 -0.491036 -0.726144
H  2.434039 -0.602118 1.059224
H  2.612998 2.122337 1.955153
H  4.11156 1.167388 2.053442
H  5.33644 2.869541 0.691164
H  4.639096 3.55224 2.16952
H  0.554297 0.909941 1.407007
H  3.935451 1.073403 -0.499136
H  -1.321579 0.094821 -0.067017
H  -0.134436 -0.693549 -1.150515
H  1.758447 4.124934 1.388333
H  5.39587 4.566924 -0.96964
H  4.239528 6.326612 -2.353957
H  1.608277 2.128393 -0.586063
H  -0.369828 -3.632719 2.358484
H  -0.459945 4.002526 -0.72051
H  -0.458918 5.392229 -1.889494
H  -1.623889 5.377419 -0.503968
H  0.672804 8.855958 -2.330982
H  1.909417 8.916829 -1.014792
H  0.379775 7.981031 -0.767428
H  -2.125563 -5.493343 2.058527
H  -4.634803 -5.198395 -0.704641
H  -5.074056 -9.548422 0.892426
H  -4.390309 -8.59978 2.255257
H  -6.165125 -8.67255 1.992005
H  -6.675112 -6.291746 -0.415538
H  -5.586308 -7.186582 -1.513712
H  -6.799947 -8.066185 -0.546945
