program: Gaussian 09
title: 000208890
version: EM64L-G09RevD.01
frameworkgroup: C1[X(C11H18Br2O4)]
method: RPBEPBE
basis: SDD
operation: Freq
keyword: #p
keyword: freq=noraman
keyword: PBEPBE/SDD
title: #p freq=noraman PBEPBE/SDD
converged: YES YES NO NO
title: Mulliken charges:
elementType: Br Br O O O O C C C C C C C C C C C H H H H H H H H H H H H H H H H H H
charge: -0.004618 -0.004599 -0.244184 -0.244164 -0.221445 -0.221456 -0.365129 -0.373066 -0.373013 -0.321254 -0.321328 0.342988 0.342931 -0.543016 -0.542952 -0.635611 -0.635599 0.199618 0.199492 0.223290 0.237224 0.223238 0.237201 0.230343 0.233104 0.233133 0.230358 0.317516 0.317490 0.266869 0.228513 0.246375 0.266872 0.228512 0.246363
chargesum: 0.00000
title: Mulliken charges with hydrogens summed into heavy atoms:
elementType: Br Br O O O O C C C C C C C C C C C
charge: -0.004618 -0.004599 -0.244184 -0.244164 -0.221445 -0.221456 0.033982 0.087448 0.087426 0.142194 0.142163 0.342988 0.342931 -0.225499 -0.225462 0.106147 0.106149
polarizability: 1.87663810e+02 -1.36650357e-02 1.79183789e+02 9.45915680e+00 -9.19114413e-03 1.22605745e+02
1716.lowfreq: -3.8723 0.0005 0.0005 0.0006 2.6248 4.3301 8.4528 14.2297 20.4673
frequency: 8.4433 14.2222 20.4522 27.1415 36.3260 48.9322 55.8244 83.9938 96.8792 101.8641 130.5260 148.2670 182.2041 191.9706 210.3420 220.3022 238.1262 240.4685 250.7983 270.4384 288.3227 315.4531 325.4177 358.8978 413.6192 479.9259 505.6611 536.2836 555.1503 638.8349 640.5157 710.6726 710.8445 746.8370 768.0743 794.2699 810.0801 858.9054 913.7656 916.7131 972.3304 984.1432 985.8401 1022.2000 1034.7736 1065.2570 1066.0540 1073.7914 1087.0000 1093.8979 1100.1535 1118.9789 1123.1378 1160.8395 1194.6383 1200.1897 1200.8573 1240.0810 1255.5815 1285.8249 1298.1990 1300.1384 1306.7811 1323.4902 1325.6120 1355.9163 1371.0122 1376.1304 1397.6356 1397.6598 1454.7475 1455.6879 1460.0044 1460.0261 1465.1250 1465.1726 1469.3764 1474.7664 1487.0461 1637.2245 1637.3925 2960.6694 2989.4647 2989.5106 2996.2689 3000.1458 3007.6585 3021.4091 3022.1660 3053.4200 3063.7041 3086.2885 3086.3053 3104.1236 3104.5887 3104.7831 3105.4203 3128.7156 3128.7830
redmass: 9.2069 15.4015 4.0429 12.0340 4.3679 7.9946 3.5539 2.9521 6.2566 2.4018 2.1207 8.8315 6.6911 4.9280 2.7747 2.6587 1.3352 1.1722 2.0421 3.2169 4.9344 3.7850 4.4166 4.6139 4.0977 4.6461 5.1302 4.3746 4.1835 4.0747 4.1015 6.6018 6.5905 1.0687 1.2513 2.5710 2.9153 1.5047 6.3095 5.6261 1.2514 1.5014 1.4738 4.5487 4.1422 1.5145 1.5032 2.4010 4.1375 4.1260 3.6294 2.0881 2.2409 1.8826 1.3539 1.3439 1.3652 1.2415 1.2572 1.0728 1.1422 1.0976 1.2564 1.6485 1.7051 1.4206 1.4340 1.3752 1.2128 1.2127 1.0925 1.0975 1.0421 1.0426 1.0512 1.0514 1.0680 1.0934 1.1005 9.1671 9.1218 1.0585 1.0401 1.0401 1.0598 1.0594 1.1008 1.0584 1.0583 1.1032 1.1040 1.0930 1.0930 1.1081 1.0900 1.0900 1.1079 1.0997 1.0997
irintensity: 0.0662 0.4803 1.2516 0.0538 0.2041 2.8864 0.8436 0.8530 0.0315 1.2907 0.0140 3.0018 0.2549 0.8230 3.0657 0.9783 0.9356 0.4795 0.6904 4.0124 6.1506 33.0661 2.1099 9.8541 3.4000 25.9501 14.5928 20.4971 0.1159 7.9308 9.3070 1.9477 0.8422 11.4875 0.2983 12.0295 0.0468 5.2296 19.0037 28.5738 0.9023 45.4029 8.1378 22.7684 1.6236 34.2326 65.0243 3.4609 51.6208 246.7099 0.1452 235.9864 134.8552 17.7112 5.0758 95.0776 0.2061 7.9958 16.2223 0.3865 0.3016 0.2649 0.0508 53.4400 39.5275 1.7979 0.2657 1.2660 41.2306 7.5451 2.7939 12.0271 27.9818 1.4069 6.1781 24.7911 0.0599 0.0039 23.4486 287.0187 22.5606 24.8259 13.5267 9.8370 0.6067 16.7773 11.5568 3.9124 84.8586 0.5501 28.1259 8.2736 12.1046 1.7694 4.0672 4.3890 46.8854 9.2402 10.1812
temp: 298.150 k
press: 1.00000 atm
elementType: 35 35 8 8 8 8 6 6 6 6 6 6 6 6 6 6 6 1 1 1 1 1 1 1 1 1 1 1 1 1 1 1 1 1 1
symmnumber: 1
zpe: 729745.4 jmol-1
zpe.correction: 0.277945 hartree
zpe.thermalcorrener: 0.299037 hartree
zpe.thermalcorrenthalpy: 0.299981 hartree
zpe.thermalcorrgfe: 0.220176 hartree
zpe.sumelectzpe: -756.439858 hartree
zpe.sumelectthermal: -756.418767 hartree
zpe.sumelectthermalent: -756.417823 hartree
zpe.sumelectthermalfe: -756.497628 hartree
dipole: 0.0013 -3.6654 0.0009
dipole: 3.6654
quadrupole: -100.8796 -118.2882 -129.0430
quadrupole: 0.0024 -10.8698 -0.0041
quadrupole: 15.1907 -2.2179 -12.9728 0.0024 -10.8698 -0.0041
hfenergy: -756.7178035 hartree
pointgroup: C01 [X(C11H18Br2O4)]
dipole: -0.0027389 1.4420015 0.0161485 debye
polarizability: 189.0096711|-0.0036203|179.1765793|0.3265917|0.6452396|121.2670937 unknown
InChI: InChI=1S/C11H18Br2O4/c1-8(12)10(14)16-6-4-3-5-7-17-11(15)9(2)13/h8-9H,3-7H2,1-2H3
charge 0 multiplicity 1
35 atoms
Br -4.698329 -3.13722 -0.925838
Br 4.712155 -3.142792 0.872693
O  -3.492191 0.112494 -1.420872
O  3.493773 0.090574 1.439469
O  -4.365891 0.030297 0.747544
O  4.369344 0.060704 -0.729508
C  0.000149 0.935743 0.017299
C  -1.196843 0.074682 -0.449907
C  1.198466 0.067868 0.468138
C  -2.353981 0.955793 -0.93871
C  2.353395 0.941211 0.975783
C  -4.398516 -0.31421 -0.45505
C  4.402216 -0.311061 0.464923
C  -5.44363 -1.227281 -1.08826
C  5.450369 -1.234274 1.078134
C  -6.806455 -1.148535 -0.408131
C  6.813258 -1.135218 0.400763
H  0.320902 1.605762 -0.807104
H  -0.32164 1.589668 0.854151
H  -0.88053 -0.600112 -1.267738
H  -1.548223 -0.559778 0.385351
H  0.882797 -0.623892 1.271904
H  1.551874 -0.5489 -0.379413
H  -2.074767 1.548449 -1.825179
H  -2.722146 1.617259 -0.133344
H  2.71984 1.620912 0.184915
H  2.072751 1.513863 1.874864
H  -5.477599 -1.070985 -2.176092
H  5.48339 -1.102166 2.16922
H  -6.712753 -1.324457 0.675272
H  -7.231422 -0.136288 -0.554975
H  -7.502516 -1.885477 -0.840081
H  6.720956 -1.28713 -0.686391
H  7.234287 -0.124938 0.570617
H  7.511813 -1.879066 0.816554
