program: Gaussian 09
title: 000208882
version: EM64L-G09RevD.01
frameworkgroup: C1[X(C17H24O8S2)]
method: RPBEPBE
basis: SDD
operation: Freq
keyword: #p
keyword: freq=noraman
keyword: PBEPBE/SDD
title: #p freq=noraman PBEPBE/SDD
converged: YES YES NO NO
title: Mulliken charges:
elementType: S S O O O O O O O O C C C C C C C C C C C C C C C C C H H H H H H H H H H H H H H H H H H H H H H H H
charge: 0.374156 0.365354 -0.221017 -0.306671 -0.341862 -0.227998 -0.252119 -0.220429 -0.444268 -0.267036 -0.376644 -0.660463 -0.675155 -0.520988 -0.378430 0.302184 0.306918 -0.490335 0.044461 0.055483 0.241949 0.182034 -0.687342 -0.681086 -0.689464 -0.695811 0.203260 0.314691 0.286397 0.290309 0.286067 0.234240 0.224217 0.230853 0.249926 0.262950 0.238626 0.239501 0.224279 0.209211 0.233153 0.215296 0.207309 0.267340 0.208932 0.247856 0.260853 0.225531 0.214769 0.250699 0.438313
chargesum: 0.00000
title: Mulliken charges with hydrogens summed into heavy atoms:
elementType: S S O O O O O O O O C C C C C C C C C C C C C C C C C
charge: 0.374156 0.365354 -0.221017 -0.306671 -0.341862 -0.227998 -0.252119 -0.220429 -0.005955 -0.267036 -0.061953 -0.083757 -0.675155 -0.000680 0.076640 0.302184 0.306918 0.022541 0.283087 0.294985 0.241949 0.182034 -0.020699 0.008859 0.028176 -0.004812 0.203260
polarizability: 2.75189993e+02 4.29631509e+00 2.43739509e+02 -9.01010180e+00 -2.49766376e+01 2.31637641e+02
1716.lowfreq: -5.5858 -0.0019 0.0008 0.0019 3.0553 8.9170 26.4887 29.3347 35.9011
frequency: 26.4566 29.2701 35.8099 39.6059 44.4353 49.3710 59.5014 64.0438 70.0112 81.4954 90.0144 91.8495 96.2937 114.4303 117.2306 145.8026 152.4355 164.4662 172.5562 192.5060 199.0668 203.6599 205.6278 223.9097 232.5675 253.3635 256.8913 261.0005 275.7564 286.9260 312.8411 322.6780 343.6998 368.5196 383.2499 397.1379 405.7775 413.3600 420.2478 443.3453 457.8016 471.1140 491.6165 521.1220 539.6820 544.0687 578.9000 594.6864 614.1311 632.6568 665.6119 671.7379 711.8637 721.0430 753.5234 777.7462 779.6929 794.1727 816.0149 830.0574 847.5112 861.2023 877.9878 892.5931 901.3983 913.7084 931.5441 933.0841 937.3737 942.2574 943.0027 945.9979 1007.8485 1008.8077 1021.9460 1037.1255 1072.3096 1095.3765 1102.4826 1107.7267 1133.2964 1136.1182 1157.9432 1158.1570 1159.1580 1172.5471 1183.2689 1189.0042 1198.7050 1200.8791 1247.7533 1260.7037 1272.8359 1278.8632 1306.5675 1318.8477 1324.9716 1329.6764 1337.6160 1339.9715 1355.5471 1383.2177 1384.6527 1385.9056 1398.1258 1401.0343 1424.6490 1450.0554 1455.9121 1458.1473 1459.9524 1460.1348 1466.8767 1468.0493 1472.6844 1475.7835 1488.2810 1491.7469 1516.5250 1595.3727 1625.5336 1633.0119 1655.3127 2986.9833 2989.0491 2992.1158 2992.5700 2997.4762 3003.9762 3016.7035 3029.8193 3038.6193 3047.5169 3052.6274 3065.5214 3074.5577 3076.0561 3082.8018 3085.1880 3092.1444 3092.7166 3098.6290 3102.5464 3103.0945 3105.6096 3106.4791 3130.4140
redmass: 4.0355 4.5533 6.0072 3.9071 5.1279 6.8550 3.8808 4.0080 4.5211 7.7440 6.9399 9.5345 7.0195 7.4193 5.7686 5.7485 5.8432 5.2272 3.5102 1.3045 3.0356 2.5104 1.1585 1.9355 2.2060 2.1807 1.7299 2.0310 3.0284 5.8605 3.9340 3.9385 3.6776 3.9489 4.7343 3.3962 3.2537 3.7226 4.0096 7.4307 3.0533 3.6245 4.3053 7.1760 3.4465 6.4073 4.1051 3.5019 7.0666 10.7819 4.0525 7.1490 4.7015 5.7254 8.6206 2.8243 3.8175 4.6510 3.5808 3.5964 7.2673 6.1428 3.1138 2.4142 2.6963 2.6398 1.2061 1.3374 1.2789 1.8463 1.4456 1.2748 8.1528 2.8757 1.8473 1.6873 2.7775 2.2083 1.7626 2.3184 4.3042 2.3070 1.3056 2.0374 1.9917 1.1889 1.9688 1.9237 1.6721 1.3000 3.2251 1.2669 1.4154 1.2602 1.3854 1.2949 1.5221 1.4701 1.4100 1.4311 1.4059 1.2641 1.5555 1.3661 1.2258 1.2200 1.1021 1.0866 1.0886 1.0521 1.1049 1.0524 1.0483 1.0495 1.0512 1.0462 1.0511 1.0526 11.0920 11.7801 10.2471 8.2631 10.0596 1.0356 1.0357 1.0358 1.0360 1.0620 1.0640 1.0629 1.0864 1.0873 1.0586 1.0982 1.0845 1.0982 1.0743 1.0995 1.0996 1.0987 1.0978 1.1006 1.1009 1.1005 1.0960 1.1010 1.1088
irintensity: 0.7620 1.2713 0.7426 0.2424 1.4419 0.1186 0.9671 2.8989 1.0251 1.0177 0.7737 0.8060 1.1128 0.2679 3.2711 2.0824 2.1466 1.8905 4.0871 0.1380 6.4371 2.4446 0.6310 11.3580 7.0293 6.3281 7.3224 1.3577 0.1660 2.8436 1.7873 2.8030 1.9915 5.9943 3.2570 11.3203 6.5693 4.8736 2.5281 8.3317 2.8639 4.5518 7.6180 9.3835 3.5693 3.0197 2.7640 3.3064 26.2323 4.4946 7.6679 4.4604 18.5592 0.6871 21.3414 24.1169 7.8501 31.3111 0.7024 1.9918 35.8736 34.3421 25.5527 25.5104 19.2746 37.3424 3.4709 1.9216 138.9680 81.7985 8.9848 16.6734 387.1505 120.9085 11.6421 32.3760 89.9533 209.0958 124.1917 219.6774 227.4659 41.4151 25.7109 14.2116 21.5666 3.2393 41.2273 9.6295 2.6906 114.7337 271.5626 11.1254 26.9522 9.9341 0.2836 3.6102 16.1895 0.6719 2.2975 26.8748 5.2853 23.6130 38.0159 47.8888 20.8767 24.3399 11.8063 35.2846 24.1093 5.9432 38.9324 6.8320 7.2490 10.7043 11.8995 6.8813 17.9422 19.7080 170.9855 405.2542 157.0578 200.2789 146.5106 13.8816 13.8606 24.4621 17.3584 13.7964 13.2428 33.8142 5.1230 20.7335 7.0467 8.0713 8.9509 98.0788 612.3629 14.4047 2.5592 58.7019 29.9008 18.9465 10.6504 28.2806 3.4882 14.6612 2.6017
temp: 298.150 k
press: 1.00000 atm
elementType: 16 16 8 8 8 8 8 8 8 8 6 6 6 6 6 6 6 6 6 6 6 6 6 6 6 6 6 1 1 1 1 1 1 1 1 1 1 1 1 1 1 1 1 1 1 1 1 1 1 1 1
symmnumber: 1
zpe: 1031015.6 jmol-1
zpe.correction: 0.392693 hartree
zpe.thermalcorrener: 0.423163 hartree
zpe.thermalcorrenthalpy: 0.424108 hartree
zpe.thermalcorrgfe: 0.329552 hartree
zpe.sumelectzpe: -2058.062217 hartree
zpe.sumelectthermal: -2058.031747 hartree
zpe.sumelectthermalent: -2058.030802 hartree
zpe.sumelectthermalfe: -2058.125358 hartree
dipole: -2.8371 -1.0630 -0.2661
dipole: 3.0414
quadrupole: -167.6338 -165.8737 -167.1147
quadrupole: -1.8468 -11.7157 -4.8715
quadrupole: -0.7597 1.0004 -0.2406 -1.8468 -11.7157 -4.8715
hfenergy: -2058.4549101 hartree
pointgroup: C01 [X(C17H24O8S2)]
dipole: -1.1956535 0.0371679 -0.0289207 debye
polarizability: 269.2003929|-9.8402733|259.4326376|21.7872489|5.8947838|221.9341127 unknown
InChI: InChI=1S/C17H24O8S2/c1-9(2)23-15(21)14(16(22)24-10(3)4)17-26-8-13(27-17)25-12(20)7-5-6-11(18)19/h9-10,13,18H,5-8H2,1-4H3
charge 0 multiplicity 1
51 atoms
S  -1.176764 -0.036166 -2.112683
S  0.04747 2.694068 -1.413422
O  -2.572733 1.38727 -0.167271
O  0.877692 -1.822252 -1.974304
O  2.557095 0.577057 1.064309
O  -3.959688 -0.489718 -0.258129
O  2.816029 -1.677063 -0.677313
O  2.891046 2.21484 -0.562563
O  0.601678 -1.201322 1.675908
O  -0.382308 0.363324 3.083223
C  -2.382981 1.356719 -1.623484
C  -1.753824 2.683621 -2.005661
C  0.267395 0.885146 -1.479147
C  -3.320167 0.496389 1.933804
C  -3.023921 -0.851181 2.6452
C  1.421203 0.286124 -1.004357
C  -3.359343 0.365738 0.424566
C  -1.713894 -1.532529 2.195762
C  1.063155 -3.315229 -2.108378
C  3.481239 1.298815 2.032782
C  1.783527 -1.142699 -1.158228
C  2.379121 1.128672 -0.213402
C  0.485156 -3.680275 -3.476698
C  0.362002 -3.99241 -0.922249
C  2.677609 2.40573 2.727001
C  4.008421 0.210095 2.96972
C  -0.463613 -0.679879 2.384535
H  -3.329218 1.132329 -2.145662
H  -2.2570 3.523877 -1.502272
H  -1.757604 2.819526 -3.09805
H  -2.567769 1.249354 2.213782
H  -4.311133 0.861887 2.266858
H  -3.857855 -1.553618 2.463504
H  -2.98503 -0.647217 3.730376
H  -1.565343 -2.470729 2.765917
H  -1.763407 -1.833831 1.133274
H  2.152225 -3.501768 -2.066053
H  4.289827 1.726076 1.412664
H  -0.589385 -3.431141 -3.527434
H  0.599562 -4.765553 -3.651305
H  1.009175 -3.139676 -4.283229
H  -0.723484 -3.788767 -0.949144
H  0.515478 -5.086285 -0.970554
H  0.768149 -3.623372 0.034564
H  3.31078 2.900989 3.486062
H  2.351058 3.168243 2.000348
H  1.788668 1.98132 3.226149
H  3.197133 -0.202028 3.595858
H  4.773216 0.640925 3.640709
H  4.467039 -0.611424 2.394169
H  1.403214 -0.574004 1.627846
