program: Gaussian 09
title: 000208877
version: EM64L-G09RevD.01
frameworkgroup: C1[X(C7H12O5)]
method: RPBEPBE
basis: SDD
operation: Freq
keyword: #pfreq=noraman
keyword: PBEPBE/SDD
title: #p freq=noraman PBEPBE/SDD
converged: NO YES NO NO
title: Mulliken charges:
elementType: O O O O O C C C C C C C H H H H H H H H H H H H
charge: -0.445634 -0.414354 -0.414421 -0.221853 -0.220919 0.286755 -0.387838 -0.543601 -0.547153 -0.719153 0.202606 0.201275 0.240664 0.237912 0.242731 0.234940 0.235123 0.244947 0.222075 0.225634 0.228499 0.347179 0.382324 0.382260
chargesum: 0.00000
title: Mulliken charges with hydrogens summed into heavy atoms:
elementType: O O O O O C C C C C C C
charge: -0.098455 -0.032030 -0.032160 -0.221853 -0.220919 0.286755 0.090739 -0.065930 -0.067083 -0.042945 0.202606 0.201275
polarizability: 1.04259506e+02 -3.50638334e-01 9.86014292e+01 6.49598252e-02 -5.12592190e-01 7.12050383e+01
1716.lowfreq: -11.4004 -6.8780 0.0005 0.0006 0.0006 3.2084 24.0912 31.8892 40.7827
frequency: 23.8807 31.8824 40.7318 64.7150 104.8509 112.6358 182.2462 215.7628 227.6063 260.7379 281.7519 306.9281 378.9212 404.5189 423.8050 446.8936 466.4657 527.4181 529.2736 586.6465 628.0380 656.7586 724.2504 761.4735 788.9803 819.6207 852.8861 884.9559 905.3378 974.4855 977.1217 1000.8306 1056.3381 1063.4597 1112.5375 1120.4669 1149.1486 1178.5319 1195.2260 1263.2950 1292.2475 1309.0099 1310.3981 1319.9252 1338.1853 1372.5561 1393.0669 1437.6906 1456.3031 1470.7066 1480.9019 1491.6610 1665.1849 1670.7077 2985.6527 3018.8801 3022.9608 3024.1504 3066.9517 3079.5574 3086.3868 3093.2452 3093.8111 3510.0705 3510.4572 3548.6975
redmass: 5.5620 5.3572 3.8970 7.8817 2.1111 6.3829 2.6010 4.5988 1.8848 4.3565 1.3153 1.8839 4.2784 2.2464 2.1139 3.2693 2.8250 4.1572 2.8265 2.6485 1.2593 1.8314 2.5272 3.5767 1.6422 5.2203 2.8966 5.4120 1.7810 1.8729 2.1827 2.2076 1.8710 2.4026 1.8661 2.3316 1.9126 1.2013 1.3003 1.1936 1.4942 1.3715 2.2695 1.7438 1.6420 1.7164 1.2139 1.1000 1.1076 1.0640 1.0745 1.0438 8.5223 8.4727 1.0361 1.0592 1.0596 1.0595 1.0999 1.0977 1.1032 1.1023 1.1020 1.0639 1.0639 1.0659
irintensity: 0.2944 2.6712 4.7574 0.7537 3.1576 0.1075 0.8045 0.4283 0.3725 0.8198 80.5616 99.3756 20.4984 5.7989 2.5681 0.9540 2.8877 65.1788 14.4017 85.8476 86.6872 128.5136 15.9228 0.7932 6.6673 3.5110 39.0920 28.5182 2.5566 2.9845 35.2251 58.1146 113.7667 95.8822 203.5353 4.2624 20.8773 63.2165 23.5362 7.8856 32.6188 33.9706 99.2365 13.6255 14.5514 3.1874 20.1066 0.0705 36.1046 6.5749 12.4660 11.9695 88.8646 409.2950 24.3615 0.0252 29.5572 4.5306 2.7614 40.0687 0.7955 32.5449 26.1778 25.2272 23.2525 7.3312
temp: 298.150 k
press: 1.00000 atm
elementType: 8 8 8 8 8 6 6 6 6 6 6 6 1 1 1 1 1 1 1 1 1 1 1 1
symmnumber: 1
zpe: 495139.0 jmol-1
zpe.correction: 0.188588 hartree
zpe.thermalcorrener: 0.202458 hartree
zpe.thermalcorrenthalpy: 0.203402 hartree
zpe.thermalcorrgfe: 0.146135 hartree
zpe.sumelectzpe: -649.115607 hartree
zpe.sumelectthermal: -649.101738 hartree
zpe.sumelectthermalent: -649.100794 hartree
zpe.sumelectthermalfe: -649.158061 hartree
dipole: -0.0830 2.7396 1.7797
dipole: 3.2679
quadrupole: -68.4870 -77.8614 -69.4106
quadrupole: 0.1570 -0.2204 -4.6294
quadrupole: 3.4326 -5.9417 2.5091 0.1570 -0.2204 -4.6294
hfenergy: -649.3041959 hartree
pointgroup: C01 [X(C7H12O5)]
dipole: 0.0203573 1.2052327 -0.447266 debye
dipolederiv: -0.671945 -0.0071267 -0.0090689 -0.0098844 -0.6261597 0.2766946 -0.010131 0.2259861 -0.3271466 -0.5716788 0.3848695 0.1117227 0.3124544 -0.8104002 -0.2571908 0.1335493 -0.3324623 -0.4956555 -0.5642423 -0.3823148 -0.0900343 -0.3134541 -0.8435431 -0.2467037 -0.1205256 -0.327118 -0.4706866 -0.6538969 -0.2860156 0.0331901 -0.1766116 -0.8860531 -0.1603074 0.1899424 -0.0046481 -0.3582642 -0.6466322 0.2812117 -0.0541558 0.1709163 -0.8866912 -0.1307027 -0.2065732 0.0278214 -0.3559552 0.872256 0.0014229 0.0078218 0.0037692 0.5723698 -0.1234541 0.0037413 -0.017765 0.3394906 -0.023001 -0.0006596 0.0018801 -0.0001848 0.0434178 0.0172757 -0.000371 -0.0575552 -0.0216245 -0.5404953 -0.051092 0.0027867 -0.1210861 -0.0303072 0.0081766 0.0320074 0.0172821 -0.0320798 -0.548237 0.0367791 -0.018307 0.1080795 -0.0253553 0.0096741 -0.0419056 0.0195699 -0.0337545 0.1135718 -0.0015784 0.0047353 -0.0044846 -0.0696129 0.0108468 0.0052003 0.0001364 0.0361593 1.1147088 0.0672393 -0.323238 0.0966978 1.3963365 0.3608369 -0.6157784 0.2850094 0.4246236 1.0894208 -0.0503544 0.3382034 -0.0756382 1.4215845 0.3149517 0.6372778 0.244305 0.4137482 -0.0261119 -0.0124195 0.1206461 -0.0131352 0.0262672 0.0154851 0.1237064 0.0233107 0.0268703 -0.021399 0.0138624 -0.1248263 0.0153896 0.0223081 0.0194442 -0.1248645 0.0250501 0.0134102 0.0782418 0.0245291 0.0026862 0.0336243 -0.0296972 0.1069362 0.0372617 0.0794218 0.0792971 0.0603595 0.0126202 0.0326775 -0.00223 -0.0147095 -0.1157692 0.0383548 -0.0667314 -0.0084716 0.0633076 -0.0115244 -0.0292831 0.0053036 -0.0196792 -0.1164432 -0.0358745 -0.0674487 -0.0051091 0.0789825 -0.0232878 -0.0026008 -0.0308464 -0.0262152 0.1073232 -0.0385519 0.0806977 0.0749385 -0.0649384 0.0483194 -0.1171917 0.017854 0.0829943 0.0252911 -0.1246921 0.0598105 -0.0150011 0.0943938 0.005916 0.0051733 0.003407 -0.0538586 -0.1110779 0.0055111 -0.1584129 -0.0451431 -0.077723 -0.0526362 0.1069551 -0.0196533 0.0856148 0.0225376 0.1149833 0.0522359 0.0076316 0.4002369 0.0071715 0.0065205 0.0053094 0.1810267 -0.1164466 0.0091243 -0.1675057 0.1064467 0.2198802 -0.0906765 0.0841743 -0.1525275 0.2430138 0.038116 0.0921675 0.0267659 0.3274932 0.2249412 0.0857446 -0.0904671 0.1469312 0.2473489 0.0445059 -0.1035597 0.0322445 0.3187825 unknown
polarizability: 104.239733|0.3484291|97.0841869|0.4976128|6.3173594|72.7420536 unknown
InChI: InChI=1S/C7H12O5/c1-2-7(12,3-5(8)9)4-6(10)11/h8,10,12H,2-4H2,1H3
charge 0 multiplicity 1
24 atoms
O  -0.028154 -1.342064 0.725141
O  -3.147611 0.645071 0.28398
O  3.103517 0.721611 0.312031
O  -3.0770 -1.599508 -0.305692
O  3.051971 -1.551296 -0.161325
C  -0.017247 -0.116982 -0.092396
C  -0.030761 1.01921 0.958523
C  -1.266625 -0.098391 -1.043353
C  1.253969 -0.097287 -1.013874
C  0.006551 2.454969 0.399134
C  -2.556666 -0.46454 -0.339763
C  2.532154 -0.420765 -0.26999
H  -0.938132 0.884457 1.572563
H  0.834669 0.857753 1.625076
H  -1.361366 0.898433 -1.506078
H  -1.12066 -0.84718 -1.842232
H  1.14023 -0.868074 -1.797203
H  1.340635 0.889242 -1.498961
H  -0.862288 2.671838 -0.248487
H  -0.025403 3.177634 1.233918
H  0.935403 2.654265 -0.164927
H  -0.000854 -2.148561 0.148172
H  -3.979328 0.353717 0.748118
H  3.9243 0.458145 0.810928
