program: Gaussian 09
title: 000208876
version: EM64L-G09RevD.01
frameworkgroup: C1[X(C5H12O4)]
method: RPBEPBE
basis: SDD
operation: Freq
keyword: #pfreq=noraman
keyword: PBEPBE/SDD
title: #p freq=noraman PBEPBE/SDD
converged: YES YES NO NO
title: Mulliken charges:
elementType: O O O O C C C C C H H H H H H H H H H H H
charge: -0.420516 -0.431590 -0.431495 -0.420476 -0.344207 -0.412440 -0.412841 -0.125970 -0.125950 0.213383 0.214021 0.215899 0.227358 0.228095 0.215359 0.210766 0.211025 0.340598 0.354184 0.354207 0.340592
chargesum: 0.00000
title: Mulliken charges with hydrogens summed into heavy atoms:
elementType: O O O O C C C C C
charge: -0.079918 -0.077406 -0.077288 -0.079884 0.083196 0.030817 0.030612 0.084796 0.085075
polarizability: 8.35618414e+01 2.66971652e-03 6.20199555e+01 2.12973070e+00 3.39271183e-03 6.24827910e+01
1716.lowfreq: -17.8627 -7.2448 0.0007 0.0007 0.0008 4.1660 44.2956 54.5718 92.7937
frequency: 44.1765 53.9553 92.7916 123.7365 126.4123 228.2039 249.1810 353.7663 355.0496 385.8117 390.2849 422.9395 476.0783 489.0900 520.7339 553.4365 572.1182 765.2730 819.0065 855.8693 921.3858 950.3337 950.8048 1006.2768 1037.0981 1059.7886 1062.5304 1088.2430 1107.3981 1210.4960 1225.6729 1235.1245 1271.0493 1272.2084 1298.4569 1301.4570 1327.2296 1362.3431 1375.9859 1378.8879 1402.6924 1410.7739 1459.7491 1461.7828 1487.2323 2977.2186 2977.8133 2987.1713 3018.4870 3019.5779 3027.9929 3050.5745 3066.5840 3531.7292 3532.1624 3551.0503 3551.5163
redmass: 5.2647 4.1742 5.5335 2.7271 2.0186 4.8311 5.0310 1.1633 1.1455 3.2265 1.8150 1.4377 2.6092 1.8006 2.0884 2.6519 3.4228 1.1885 2.0149 3.0512 1.9318 5.3325 6.4397 2.8750 2.2028 1.4103 2.5469 2.1837 1.2649 1.2938 1.3525 1.2265 1.3663 1.2819 1.1491 1.2973 1.2824 1.2993 1.1980 1.3653 1.5468 1.5842 1.0885 1.0787 1.0965 1.0630 1.0635 1.0614 1.0854 1.0845 1.0981 1.0994 1.1021 1.0651 1.0651 1.0655 1.0655
irintensity: 0.0083 0.1054 0.0166 0.1123 0.6414 0.8990 0.2028 67.1753 227.4663 1.6214 84.9360 1.6300 31.0285 267.5477 4.4746 0.9361 101.2615 0.4958 18.6719 115.7507 27.4475 105.9493 85.3269 208.3639 1.1269 117.1103 0.7162 6.9216 40.4929 4.2476 6.7342 26.1202 14.2953 50.3974 0.4923 0.7668 10.4825 2.0206 21.7171 22.7709 42.1809 23.8938 3.7303 5.0856 17.3056 3.2119 3.0707 32.7032 32.4407 63.5248 5.0145 0.4695 95.6928 4.5028 3.8105 4.2809 3.4560
temp: 298.150 k
press: 1.00000 atm
elementType: 8 8 8 8 6 6 6 6 6 1 1 1 1 1 1 1 1 1 1 1 1
symmnumber: 1
zpe: 459574.1 jmol-1
zpe.correction: 0.175043 hartree
zpe.thermalcorrener: 0.186069 hartree
zpe.thermalcorrenthalpy: 0.187013 hartree
zpe.thermalcorrgfe: 0.137698 hartree
zpe.sumelectzpe: -497.843677 hartree
zpe.sumelectthermal: -497.832650 hartree
zpe.sumelectthermalent: -497.831706 hartree
zpe.sumelectthermalfe: -497.881021 hartree
dipole: 0.0052 -0.2287 -0.0012
dipole: 0.2287
quadrupole: -50.3309 -64.7119 -49.6014
quadrupole: -0.0555 0.0134 0.0562
quadrupole: 4.5505 -9.8305 5.2800 -0.0555 0.0134 0.0562
hfenergy: -498.0187191 hartree
pointgroup: C01 [X(C5H12O4)]
dipole: -0.0003585 -0.0455457 -0.0776076 debye
dipolederiv: -0.7683759 -0.1227996 -0.0282989 0.0221495 -0.92106 -0.0739234 0.0050231 -0.0302964 -0.159706 -0.7690755 0.3250079 0.2300195 0.2347876 -0.7513006 0.0802945 0.2593363 -0.01897 -0.3775202 -0.8104193 -0.0285458 -0.3852265 -0.1038971 -0.4870299 0.1353024 -0.3181133 0.2295625 -0.6005502 -0.7633049 -0.0122077 0.123323 0.0293433 -0.2891406 0.3095865 -0.0219237 0.2699836 -0.7966875 -0.0054353 0.0296524 -0.0160646 0.0036674 0.116421 -0.0448369 0.0005008 -0.0434392 0.0684409 -0.1953997 -0.0104654 -0.0611174 -0.0243936 0.0426056 -0.0267796 -0.1523848 -0.0760335 0.0566132 -0.1844291 0.054959 0.0473798 0.1232966 0.0930068 -0.0525477 0.1042517 -0.0034862 -0.0042287 1.01861 -0.1230061 -0.0731586 -0.1372539 1.087859 0.0231638 -0.0634713 0.0633767 0.4815089 1.033292 -0.0156106 0.1386678 -0.0275675 0.5846281 -0.2117335 0.1462191 -0.251358 0.9689067 0.0815991 0.0025455 0.0118687 0.001305 0.0458982 0.0805008 0.0051229 0.0621647 -0.118694 0.0779403 -0.0176668 -0.0093552 -0.013009 -0.1410829 -0.0372681 -0.0045722 -0.0194466 0.0697641 0.0524276 -0.0129447 0.0329506 -0.0124229 0.051561 0.0921122 0.0476467 0.0602552 -0.1268756 0.0607451 -0.0593819 0.0003224 -0.0237702 -0.1367118 -0.0226035 0.0010014 -0.0147628 0.0872259 0.0633593 -0.0245223 0.0440704 -0.0074198 0.052359 0.0875961 0.0124867 0.0813725 -0.1042888 0.05066 -0.0392104 -0.0037411 -0.0536655 -0.1486594 -0.0470658 -0.0109013 -0.0154179 0.0752337 -0.0082905 0.0035995 0.0294574 0.0049807 -0.0167743 0.021243 0.0530876 0.0387394 -0.1744364 -0.0119243 -0.0290267 -0.0186921 -0.0483121 -0.1625989 -0.0382365 -0.031353 -0.0568321 -0.0247916 0.4161692 0.0104081 -0.0250877 0.0024345 0.2820624 0.0012059 -0.0010965 0.0625107 -0.0049807 0.11567 -0.027316 -0.1111668 -0.0624932 0.3467267 -0.0967687 -0.1492615 -0.0864008 0.2133272 0.1297018 0.0813203 0.0816487 0.0979642 0.3183283 -0.1071588 0.1308918 -0.1172671 0.2279684 0.4164802 0.015211 -0.0077994 -0.0057242 0.0329025 -0.0720826 -0.0124907 -0.1342548 0.2437704 unknown
polarizability: 83.2731733|-3.0417129|62.6416472|1.1356742|-0.2760827|62.1497674 unknown
InChI: InChI=1S/C5H12O4/c6-4(7)2-1-3-5(8)9/h4-9H,1-3H2
charge 0 multiplicity 1
21 atoms
O  2.852252 1.11531 0.514692
O  3.530834 -1.088921 -0.169879
O  -3.670357 0.25922 -0.741214
O  -2.873416 -0.201224 1.481633
C  -0.038734 0.09232 0.351157
C  1.193585 -0.571609 -0.29804
C  -1.320491 -0.133618 -0.477721
C  2.485393 -0.301576 0.476687
C  -2.568695 0.436999 0.199736
H  -0.187575 -0.310359 1.372571
H  0.148231 1.178032 0.467854
H  1.328118 -0.215331 -1.340357
H  1.050653 -1.66745 -0.351721
H  -1.221796 0.343511 -1.4711
H  -1.484523 -1.216267 -0.658637
H  2.385499 -0.556457 1.549829
H  -2.438336 1.500059 0.481379
H  2.907916 1.444401 -0.420993
H  4.38118 -0.945036 0.320557
H  -4.494688 0.63229 -0.334305
H  -2.947251 -1.179995 1.328669
