program: Gaussian 09
title: 000208870
version: EM64L-G09RevD.01
frameworkgroup: C1[X(C8H17NO2)]
method: RPBEPBE
basis: SDD
operation: Freq
keyword: #p
keyword: freq=noraman
keyword: PBEPBE/SDD
title: #p freq=noraman PBEPBE/SDD
converged: YES YES NO NO
title: Mulliken charges:
elementType: O O N C C C C C C C C H H H H H H H H H H H H H H H H H
charge: -0.205921 -0.205652 0.142389 -0.043328 -0.404295 -0.378178 -0.365608 -0.423814 -0.359516 -0.719088 -0.697397 0.207803 0.222827 0.193894 0.224409 0.203017 0.180845 0.218792 0.252109 0.253897 0.191823 0.204603 0.239080 0.204445 0.223443 0.214396 0.217801 0.207224
chargesum: 0.00000
title: Mulliken charges with hydrogens summed into heavy atoms:
elementType: O O N C C C C C C C C
charge: -0.205921 -0.205652 0.142389 0.164475 0.012425 0.049248 0.034029 0.082192 0.036910 -0.052119 -0.057975
polarizability: 1.25832330e+02 -6.21121053e+00 9.49910547e+01 -8.79066090e-01 -1.50322663e+00 8.34726390e+01
1716.lowfreq: -17.2506 0.0005 0.0007 0.0009 2.5808 5.0128 25.2720 40.9942 49.9912
frequency: 24.5157 40.8513 49.7571 76.1987 101.5590 116.8783 145.7445 172.4671 228.3062 236.0925 243.9284 264.0276 303.2868 428.9603 445.9992 468.5445 497.1461 573.7620 697.4596 727.8338 766.2592 785.2563 810.2224 849.6250 894.1368 898.6955 921.7149 980.2199 1007.1861 1036.0783 1054.9311 1081.3849 1087.7361 1111.5965 1120.2686 1157.8705 1198.2067 1208.1161 1223.0392 1243.1307 1262.6311 1273.1059 1286.2608 1295.9966 1316.2597 1337.3785 1342.5367 1348.1339 1356.6764 1387.4285 1393.2400 1415.7482 1452.1757 1464.5982 1465.9227 1472.3252 1476.9704 1477.2033 1479.6525 1486.5075 1497.8950 2950.3226 2953.8860 2965.9763 2972.0846 2972.5151 2976.2572 2982.6636 3002.9087 3018.9293 3032.1724 3043.0295 3056.3573 3069.1300 3070.4112 3073.2365 3082.6897 3128.8969
redmass: 9.7518 2.0013 2.7485 3.2311 2.9646 2.6352 2.0494 2.9894 1.8450 1.3761 1.3571 2.8049 3.3432 2.8971 3.0909 2.3030 2.4481 6.7632 2.9477 1.1127 1.1764 2.8581 1.8812 2.5463 1.8151 2.2876 1.2869 1.5497 2.6685 1.5419 2.6282 2.5752 1.9974 1.7655 1.5642 3.0307 1.4126 1.8484 1.7900 1.3694 1.3247 1.3912 1.2257 1.0850 1.4065 1.4239 1.5768 1.3521 1.5505 1.2162 1.2530 3.4037 1.0781 1.0873 1.1151 1.0725 1.0552 1.0459 1.0699 1.0798 1.0492 1.0800 1.0629 1.0599 1.0504 1.0462 1.0373 1.0608 1.0945 1.1016 1.1008 1.1029 1.0571 1.1006 1.0988 1.0995 1.1000 1.1083
irintensity: 1.3735 0.1555 0.6068 0.7681 0.1964 0.9545 1.4367 2.3675 0.5591 0.5181 0.3495 1.5397 0.1040 0.4443 0.6741 0.8542 0.4618 10.0823 14.1073 4.4385 8.4012 5.2877 1.7181 5.6153 5.7437 1.2416 4.9235 6.2207 2.5515 0.7940 4.8339 0.4237 19.9959 6.8675 2.0830 5.8394 30.3684 40.2168 28.7079 7.3629 7.9129 6.1295 1.2221 2.1446 6.7277 2.6580 6.0191 2.1974 1.4899 11.5687 39.0488 105.6397 24.8351 3.0982 1.4588 6.6958 10.5638 5.8831 18.1146 18.9865 13.8186 5.7697 18.6517 15.5303 67.6130 15.4461 35.7939 49.5187 6.1544 1.0061 2.0121 55.8599 14.6604 69.1572 57.8305 54.8874 44.1963 4.5135
temp: 298.150 k
press: 1.00000 atm
elementType: 8 8 7 6 6 6 6 6 6 6 6 1 1 1 1 1 1 1 1 1 1 1 1 1 1 1 1 1
symmnumber: 1
zpe: 639518.3 jmol-1
zpe.correction: 0.243580 hartree
zpe.thermalcorrener: 0.257239 hartree
zpe.thermalcorrenthalpy: 0.258183 hartree
zpe.thermalcorrgfe: 0.201489 hartree
zpe.sumelectzpe: -519.253484 hartree
zpe.sumelectthermal: -519.239825 hartree
zpe.sumelectthermalent: -519.238880 hartree
zpe.sumelectthermalfe: -519.295574 hartree
dipole: -1.0153 -3.3194 1.9819
dipole: 3.9971
quadrupole: -73.4621 -75.2245 -66.9693
quadrupole: -4.0600 3.0785 3.3187
quadrupole: -1.5768 -3.3392 4.9160 -4.0600 3.0785 3.3187
hfenergy: -519.4970634 hartree
pointgroup: C01 [X(C8H17N1O2)]
dipole: -0.4264598 -1.2901571 0.7916386 debye
polarizability: 125.5129233|-6.9462816|95.2780483|-1.0590792|-1.5396972|83.5050526 unknown
InChI: InChI=1S/C8H17NO2/c1-3-5-6-8(4-2)7-9(10)11/h8H,3-7H2,1-2H3
charge 0 multiplicity 1
28 atoms
O  2.540155 1.586516 -0.404758
O  0.365306 2.271836 -0.3464
N  1.3307 1.506948 0.034513
C  0.577596 -0.907039 0.314549
C  -0.737997 -0.750596 -0.495168
C  1.704661 -1.523475 -0.558264
C  -1.964762 -0.281631 0.320138
C  1.011194 0.405247 1.030654
C  -3.277064 -0.349095 -0.495126
C  3.014197 -1.841426 0.195152
C  -4.504433 0.141942 0.30216
H  0.378843 -1.607154 1.156329
H  -0.575712 -0.05424 -1.342083
H  -0.965386 -1.73872 -0.945207
H  1.925029 -0.849484 -1.409179
H  1.300834 -2.456842 -0.998217
H  -2.070643 -0.908079 1.231598
H  -1.814935 0.762476 0.658634
H  1.927756 0.248714 1.619639
H  0.201738 0.791921 1.668222
H  -3.445696 -1.39244 -0.832285
H  -3.163115 0.261636 -1.413396
H  3.540428 -0.919256 0.498523
H  2.823062 -2.45187 1.098937
H  3.704723 -2.411528 -0.452128
H  -4.375013 1.19385 0.619089
H  -5.428538 0.082892 -0.301561
H  -4.656528 -0.467306 1.213332
