program: Gaussian 09
title: 000208868
version: EM64L-G09RevD.01
frameworkgroup: C1[X(C13H17ClN2O7S)]
method: RPBEPBE
basis: SDD
operation: Freq
keyword: #p
keyword: freq=noraman
keyword: PBEPBE/SDD
title: #p freq=noraman PBEPBE/SDD
converged: YES YES NO NO
title: Mulliken charges:
elementType: Cl S O O O O O O O N N C C C C C C C C C C C C C H H H H H H H H H H H H H H H H H
charge: 0.060306 0.915416 -0.534325 -0.505777 -0.271386 -0.415249 -0.235628 -0.162310 -0.201188 -0.464602 0.008720 -0.390918 -0.348817 -0.431733 -0.364069 -0.489468 -0.238035 0.486889 -0.195472 -0.463310 -0.343566 0.576156 0.174214 -0.527937 0.208161 0.202385 0.207740 0.222148 0.252301 0.267246 0.215092 0.210295 0.319144 0.254680 0.262375 0.323451 0.305750 0.256716 0.237405 0.242184 0.375013
chargesum: 0.00000
title: Mulliken charges with hydrogens summed into heavy atoms:
elementType: Cl S O O O O O O O N N C C C C C C C C C C C C C
charge: 0.060306 0.915416 -0.534325 -0.505777 -0.271386 -0.040236 -0.235628 -0.162310 -0.201188 -0.145457 0.008720 0.019628 0.081071 0.087815 0.061317 0.027588 -0.238035 0.486889 0.127979 -0.157559 -0.343566 0.576156 0.174214 0.208369
polarizability: 3.16189693e+02 1.44796650e+01 2.21248695e+02 1.53464112e+01 5.78861666e+00 1.55489006e+02
1716.lowfreq: -7.9183 -1.3509 -0.0014 0.0013 0.0016 4.8690 9.1334 13.4846 17.1453
frequency: 8.4540 12.9248 16.7413 32.5326 34.6684 40.9206 56.0641 64.8145 70.8330 91.5336 98.6742 108.1452 124.5389 129.2636 150.7322 160.4398 176.6334 187.9845 205.9989 213.8207 227.6619 240.4752 249.9316 268.9620 287.8110 301.3399 333.4700 337.9170 347.8952 377.0892 391.8369 424.7692 440.1369 464.7267 480.2418 496.5115 504.7798 517.9073 564.2066 589.0204 595.5439 639.5152 659.6727 676.3595 718.2125 729.2391 737.9361 740.9392 766.2157 783.1643 810.5930 832.2458 874.2209 879.9557 890.2114 894.6994 921.6905 926.4977 971.9198 995.1238 1008.8107 1031.6534 1042.7846 1067.0602 1087.6130 1093.2050 1105.3516 1107.5770 1114.0028 1143.5619 1157.4377 1197.1141 1208.9761 1225.2916 1232.6235 1237.2915 1250.0301 1273.3168 1290.9621 1304.1977 1310.5980 1330.9506 1331.6261 1368.4756 1369.7293 1375.3034 1382.4198 1415.2049 1428.7993 1437.8579 1444.0100 1457.3304 1458.9508 1469.0746 1469.7991 1472.4280 1486.4381 1556.9747 1607.9999 1666.6725 2957.2493 2967.3297 2982.7278 2985.2716 2986.6396 2994.6505 3004.3475 3023.4010 3037.3867 3047.0185 3060.9106 3081.1660 3146.5440 3153.3696 3183.0778 3380.0648 3511.1102
redmass: 10.7481 9.4816 9.5879 6.7747 10.5993 8.0030 2.6283 4.3028 3.0171 5.0919 4.2634 4.1173 3.2620 3.2525 4.4366 4.3502 4.9473 8.0497 8.9495 1.8556 7.2860 3.0780 3.1339 5.8574 5.1184 6.1382 4.2116 5.6280 4.4344 6.6731 9.5805 6.9767 3.5888 4.3947 4.7389 2.4397 2.1287 5.8001 5.8260 4.3937 9.0801 1.3226 7.2799 7.2372 9.8908 1.1126 3.1066 8.9527 1.4491 1.9096 5.5615 3.1963 2.9811 1.7704 7.3894 1.7748 1.5051 4.8664 1.8588 7.5984 3.9938 5.7000 2.5154 3.0334 2.5614 2.4360 2.0117 1.9450 1.2706 1.2681 1.3550 13.5936 1.2443 2.1009 1.3492 1.8588 1.3206 1.3511 1.1575 1.2323 1.1320 7.0204 1.3819 1.3320 1.4921 1.6871 10.8008 9.3564 1.5100 1.0840 1.0698 1.1203 1.7201 1.0785 1.0846 1.1036 1.0965 9.1045 8.2018 8.1721 1.0606 1.0598 1.0321 1.0633 1.0621 1.0599 1.0962 1.1001 1.1009 1.1011 1.1027 1.1053 1.1013 1.0921 1.0908 1.0747 1.0639
irintensity: 0.5106 1.3086 0.5985 0.7461 0.0624 1.1735 0.3173 4.1445 0.7845 0.5364 0.5574 1.9528 1.5017 2.5730 4.2348 4.2441 5.3893 4.3961 2.1870 2.3012 1.8345 1.1287 3.6510 8.3362 11.1180 2.2725 4.0860 3.6210 0.6861 26.1963 34.6861 23.1240 16.3729 36.3341 38.6788 48.9096 27.8976 52.6654 4.9537 9.9151 8.2497 126.9506 21.2660 8.0459 6.8660 24.6880 1.8639 54.0078 85.2420 98.5789 53.0553 1.7087 0.7069 5.2246 6.7088 26.3070 30.5052 43.4663 38.2926 30.7274 132.8243 53.1611 81.1302 26.1365 43.2363 14.8728 32.6913 30.5751 1.0360 16.6374 4.6240 301.8353 23.0143 38.5292 5.3823 20.2192 4.9242 12.9960 2.2483 17.1731 2.3314 55.0480 17.7624 4.9180 25.5230 36.9225 106.1356 29.3288 85.1693 31.7944 22.1619 6.4493 194.3639 0.4297 10.9611 4.9794 24.8701 18.0696 19.7790 212.1271 16.0612 17.9700 39.8862 15.5967 17.2508 28.7117 14.6000 8.4717 9.0188 5.5363 58.7507 24.5681 10.2643 19.2219 7.4882 13.9575 18.9698
temp: 298.150 k
press: 1.00000 atm
elementType: 17 16 8 8 8 8 8 8 8 7 7 6 6 6 6 6 6 6 6 6 6 6 6 6 1 1 1 1 1 1 1 1 1 1 1 1 1 1 1 1 1
symmnumber: 1
zpe: 779954.0 jmol-1
zpe.correction: 0.297069 hartree
zpe.thermalcorrener: 0.323646 hartree
zpe.thermalcorrenthalpy: 0.324590 hartree
zpe.thermalcorrgfe: 0.234204 hartree
zpe.sumelectzpe: -1997.660023 hartree
zpe.sumelectthermal: -1997.633446 hartree
zpe.sumelectthermalent: -1997.632502 hartree
zpe.sumelectthermalfe: -1997.722888 hartree
dipole: 1.8076 3.8672 2.1414
dipole: 4.7758
quadrupole: -198.2990 -144.7339 -153.5629
quadrupole: -9.4543 -4.0237 -3.1626
quadrupole: -32.7671 20.7981 11.9690 -9.4543 -4.0237 -3.1626
hfenergy: -1997.9570922 hartree
pointgroup: C01 [X(C13H17Cl1N2O7S1)]
dipole: 0.5786106 -0.8857726 -1.5527456 debye
polarizability: 312.7795598|-7.9886265|198.6298227|-27.0083905|33.4731961|181.5180117 unknown
InChI: InChI=1S/C13H17ClN2O7S/c1-23-11-8-10(16(19)20)9(14)7-12(11)24(21,22)15-6-4-2-3-5-13(17)18/h7-8,15,17H,2-6H2,1H3
charge 0 multiplicity 1
41 atoms
Cl -4.755535 2.397445 1.89096
S  0.177785 0.442861 0.369344
O  0.437942 1.949153 0.933293
O  0.87471 -0.830724 1.107704
O  -1.424635 -1.819239 -0.857531
O  7.653685 -0.893136 1.886524
O  7.685265 -1.137163 -0.421105
O  -6.623618 0.175161 1.511469
O  -6.389169 -1.195297 -0.294339
N  0.457075 0.517358 -1.472059
N  -5.918623 -0.379028 0.592867
C  2.971094 0.87131 -1.948134
C  3.608109 0.606991 -0.565145
C  1.538074 1.44742 -1.904933
C  5.051138 0.070551 -0.684627
C  5.679589 -0.195112 0.696359
C  -1.697656 0.209215 0.377706
C  -2.279794 -0.939424 -0.212461
C  -2.45109 1.197406 1.010195
C  -3.678258 -1.083057 -0.12158
C  -3.853378 1.050694 1.106013
C  -4.453235 -0.102777 0.543354
C  7.07529 -0.778985 0.610578
C  -1.991616 -3.071314 -1.388455
H  3.602396 1.595634 -2.50294
H  2.974479 -0.062313 -2.549989
H  3.604426 1.548345 0.021657
H  2.997594 -0.118886 0.009226
H  1.229801 1.782038 -2.915148
H  1.486839 2.333264 -1.242903
H  5.059966 -0.865989 -1.274994
H  5.68044 0.790414 -1.243502
H  0.585971 -0.469585 -1.765293
H  5.730513 0.730053 1.302256
H  5.055075 -0.897135 1.284239
H  -1.942655 2.076287 1.421614
H  -4.209881 -1.928883 -0.563604
H  -1.131475 -3.622826 -1.791818
H  -2.719935 -2.861557 -2.193365
H  -2.467416 -3.656296 -0.580563
H  8.562915 -1.289677 1.797229
