program: Gaussian 09
title: 000208867
version: EM64L-G09RevD.01
frameworkgroup: C1[X(C11H22O2)]
method: RPBEPBE
basis: SDD
operation: Freq
keyword: #pfreq=noraman
keyword: PBEPBE/SDD
title: #p freq=noraman PBEPBE/SDD
converged: YES YES NO NO
title: Mulliken charges:
elementType: O O C C C C C C C C C C C H H H H H H H H H H H H H H H H H H H H H H
charge: -0.287424 -0.248887 0.050774 -0.378977 -0.368176 -0.337430 -0.523820 -0.351454 -0.355982 -0.720299 0.252047 -0.693025 -0.693757 0.225873 0.185922 0.204263 0.202620 0.224327 0.186317 0.184415 0.243189 0.235095 0.220946 0.192828 0.196470 0.198308 0.219732 0.250439 0.213926 0.217890 0.206932 0.211484 0.209486 0.209064 0.216883
chargesum: 0.00000
title: Mulliken charges with hydrogens summed into heavy atoms:
elementType: O O C C C C C C C C C C C
charge: -0.287424 -0.248887 0.276647 0.011208 0.058770 0.033303 -0.045536 0.062320 0.038796 -0.036202 0.252047 -0.056719 -0.058324
polarizability: 1.58705111e+02 9.92341987e-01 1.16807441e+02 2.09379735e+00 -2.58787255e+00 1.07078749e+02
1716.lowfreq: -5.5707 0.0004 0.0005 0.0006 4.0226 6.8990 23.3092 43.2493 48.1596
frequency: 22.7746 42.7349 47.9675 56.1490 65.7254 74.5516 108.8758 114.0325 132.9879 164.1990 168.1503 216.8519 219.4105 231.0811 232.2642 264.2686 305.1969 355.5066 397.6259 441.7193 457.1549 494.3084 565.5371 684.1775 724.8957 728.3944 753.8472 777.4553 839.5428 861.3570 871.3175 882.0195 917.3947 939.5229 956.0084 989.7763 1012.3402 1030.0654 1064.5674 1070.8548 1075.6408 1097.3823 1114.0457 1116.7082 1133.9247 1146.4125 1172.9038 1199.0127 1234.5705 1243.4523 1256.7679 1269.7504 1286.2501 1287.1212 1291.3933 1306.7059 1327.9845 1331.0504 1352.8682 1362.6219 1362.7793 1387.4642 1388.9531 1389.5963 1442.2282 1448.6824 1465.5011 1465.6593 1470.8030 1473.3306 1477.5501 1477.8789 1480.2021 1480.6540 1484.9652 1488.9970 1633.0513 2953.0881 2970.3011 2970.5902 2972.4651 2972.9467 2976.3091 2977.5669 2988.9460 2990.1925 2995.2175 3011.3943 3024.0160 3024.4505 3041.2211 3044.0587 3064.3509 3070.1184 3070.7560 3072.0130 3073.3908 3085.1090 3099.1545
redmass: 3.7303 1.9146 4.4593 2.0726 3.1060 2.4629 2.0753 1.9666 2.6042 3.0343 2.7165 1.1134 2.7254 1.2353 1.1192 3.9295 3.5630 2.9618 3.0722 2.8506 2.9744 3.0591 3.0616 4.5361 1.0942 1.3190 1.2030 2.2688 1.2972 1.4661 1.7413 2.3602 2.7403 1.9980 1.2470 1.4155 3.9111 2.0102 2.7231 2.5426 2.1900 1.9187 2.1746 1.8513 2.2960 2.4303 2.0490 1.5366 1.3567 1.3320 1.2627 1.3018 1.0978 1.0756 1.1183 1.3508 1.4388 1.2845 1.5966 1.7476 1.7104 1.2302 1.2185 1.2178 1.0852 1.0815 1.0686 1.0547 1.0708 1.0574 1.0425 1.0425 1.0462 1.0704 1.0760 1.0895 9.7785 1.0589 1.0502 1.0572 1.0384 1.0459 1.0651 1.0618 1.0366 1.0674 1.0916 1.0895 1.1015 1.0929 1.0971 1.1012 1.1004 1.1008 1.1012 1.0992 1.0991 1.0987 1.1006
irintensity: 0.1421 0.2916 1.2219 0.1294 0.5348 0.5743 0.1132 0.5026 1.6825 1.5905 1.8955 0.1353 2.6843 1.0711 0.0481 6.7827 2.5730 0.9838 3.2672 0.8557 6.9876 2.6674 3.5173 1.7966 13.6125 2.6457 1.4467 15.5017 4.6544 8.2677 2.0709 19.8804 5.0954 16.1832 0.7869 14.6452 25.2339 29.1568 6.6671 43.2402 14.9411 123.6081 9.8428 56.0562 24.0781 180.3306 1.2620 4.5580 2.7569 43.4389 10.3716 0.7605 0.2377 0.3169 1.6941 42.6168 2.2161 2.3895 7.7382 14.4147 10.1282 20.6628 10.6194 10.8888 19.9111 1.9574 0.3202 9.7626 0.7398 3.3495 12.4303 17.4291 4.6524 6.2404 12.8228 21.7600 161.5442 14.7034 14.6450 54.4525 34.8636 22.0279 1.2782 53.9492 29.4406 39.4836 10.9090 2.8875 17.3745 8.2511 6.8247 13.8477 9.3962 120.5180 82.1602 52.8043 51.0267 47.9556 21.7785
temp: 298.150 k
press: 1.00000 atm
elementType: 8 8 6 6 6 6 6 6 6 6 6 6 6 1 1 1 1 1 1 1 1 1 1 1 1 1 1 1 1 1 1 1 1 1 1
symmnumber: 1
zpe: 814388.5 jmol-1
zpe.correction: 0.310184 hartree
zpe.thermalcorrener: 0.327385 hartree
zpe.thermalcorrenthalpy: 0.328330 hartree
zpe.thermalcorrgfe: 0.263034 hartree
zpe.sumelectzpe: -581.750804 hartree
zpe.sumelectthermal: -581.733603 hartree
zpe.sumelectthermalent: -581.732658 hartree
zpe.sumelectthermalfe: -581.797954 hartree
dipole: -0.7581 0.8523 -1.3211
dipole: 1.7454
quadrupole: -74.2302 -83.4897 -85.2349
quadrupole: 2.1819 -1.4321 3.9203
quadrupole: 6.7548 -2.5048 -4.2500 2.1819 -1.4321 3.9203
hfenergy: -582.0609881 hartree
pointgroup: C01 [X(C11H22O2)]
dipole: -0.3173546 -0.4501578 0.4101012 debye
polarizability: 158.3634249|-2.9078687|117.6358741|-3.4888968|0.7058002|106.5920015 unknown
InChI: InChI=1S/C11H22O2/c1-4-6-7-9-11(12)13-10(3)8-5-2/h10H,4-9H2,1-3H3
charge 0 multiplicity 1
35 atoms
O  -1.215252 0.322531 0.706303
O  0.056661 1.818728 -0.557517
C  -2.472621 1.093746 0.378873
C  -3.619764 0.078349 0.472247
C  2.403728 0.092326 -0.226431
C  3.636412 -0.614724 0.378009
C  1.160287 -0.0208 0.679872
C  -3.551389 -1.04258 -0.589017
C  4.883592 -0.534517 -0.531843
C  -2.594746 2.267354 1.360497
C  -0.0129 0.814232 0.190057
C  -4.720667 -2.042757 -0.468959
C  6.122496 -1.219715 0.084398
H  -2.356414 1.472367 -0.655034
H  -4.57298 0.635302 0.363708
H  -3.622545 -0.364963 1.488009
H  2.175122 -0.340592 -1.220411
H  2.627023 1.161809 -0.400438
H  3.398098 -1.680964 0.576326
H  3.875138 -0.160898 1.363085
H  0.829865 -1.069112 0.793873
H  1.409107 0.333797 1.702043
H  -2.587649 -1.575946 -0.483701
H  -3.552673 -0.588262 -1.601018
H  4.650463 -0.999157 -1.511442
H  5.113291 0.53019 -0.740175
H  -2.649092 1.900566 2.401172
H  -1.733277 2.949594 1.265366
H  -3.513106 2.844895 1.147563
H  -4.653509 -2.833934 -1.237873
H  -5.695971 -1.534424 -0.591697
H  -4.72142 -2.534449 0.522157
H  6.395438 -0.750901 1.048749
H  5.928694 -2.292106 0.276363
H  6.999258 -1.149486 -0.585314
