program: Gaussian 09
title: 000208866
version: EM64L-G09RevD.01
frameworkgroup: C1[X(C10H18O5)]
method: RPBEPBE
basis: SDD
operation: Freq
keyword: #pfreq=noraman
keyword: PBEPBE/SDD
title: #p freq=noraman PBEPBE/SDD
converged: NO YES NO NO
title: Mulliken charges:
elementType: O O O O O C C C C C C C C C C H H H H H H H H H H H H H H H H H H
charge: -0.264639 -0.451892 -0.238997 -0.415873 -0.232709 -0.360048 -0.359637 -0.521089 -0.387658 -0.356647 -0.266974 -0.487170 0.242783 -0.332569 0.174142 0.215323 0.212944 0.214701 0.214915 0.246022 0.246569 0.208085 0.208868 0.215534 0.215847 0.225590 0.226870 0.254694 0.254546 0.189243 0.189129 0.343926 0.376169
chargesum: 0.00000
title: Mulliken charges with hydrogens summed into heavy atoms:
elementType: O O O O O C C C C C C C C C C
charge: -0.264639 -0.107966 -0.238997 -0.039704 -0.232709 0.068220 0.069978 -0.028498 0.029295 0.074734 0.185486 0.022070 0.242783 0.045803 0.174142
polarizability: 1.75423095e+02 -3.51567476e+00 1.15970408e+02 -1.02994025e-01 4.47922610e-01 8.71459573e+01
1716.lowfreq: -15.7316 -1.2506 0.0007 0.0010 0.0014 3.9465 12.6290 19.3794 28.9015
frequency: 1.5759 19.2183 28.6025 34.0014 41.1297 49.0009 78.8346 88.3934 102.9248 117.7371 125.7694 145.4309 163.3356 186.4493 217.1880 276.0622 288.4392 315.9695 369.5060 449.2233 469.0557 500.8533 510.4669 547.4789 587.0212 638.0132 681.8287 724.6815 761.5873 785.8212 808.5314 858.5077 865.9750 900.9112 926.6364 929.0041 973.5878 1013.3174 1020.6560 1051.0065 1060.3370 1074.8372 1085.6057 1094.6326 1098.4606 1131.4634 1134.3592 1135.5668 1170.7384 1212.6261 1230.1155 1231.0106 1245.8066 1263.3362 1272.9672 1278.7684 1286.9512 1288.5425 1289.2911 1319.0383 1342.2626 1363.6075 1377.2326 1380.1146 1417.9796 1437.4862 1441.7508 1467.2398 1470.6833 1470.9653 1481.7148 1482.5087 1491.6373 1638.5855 1667.3713 2928.8082 2975.8946 2986.8165 2987.1988 2987.7606 2992.4360 2995.2072 3000.4047 3004.0797 3024.6026 3032.8918 3033.3595 3049.0385 3057.7487 3070.0183 3078.3242 3511.5978 3568.6079
redmass: 5.3677 5.0782 5.3823 3.5818 2.2218 3.2793 5.3546 2.7434 2.1727 1.9824 2.3339 5.9335 6.3725 2.9413 5.7141 1.0820 6.7527 4.8665 3.9421 4.4364 4.0383 1.7761 4.0612 2.6516 4.7411 1.3222 5.8952 1.1307 1.0701 1.4228 1.1373 4.8281 8.0894 1.5109 1.2139 6.3341 7.5325 2.6762 3.2631 3.6843 3.0373 2.2505 1.8335 2.7115 2.6931 2.5802 1.3894 1.5601 1.1794 1.2647 1.3453 1.3452 1.2535 1.5666 1.2889 1.0798 1.1409 1.1349 1.0489 1.6636 1.3904 1.7003 1.7807 1.6820 1.4430 1.0831 1.0870 1.0768 1.0743 1.0832 1.0828 1.0950 1.0927 9.7785 8.1938 1.0546 1.1066 1.0612 1.0601 1.0611 1.0604 1.0587 1.0591 1.0569 1.0980 1.0989 1.1017 1.1016 1.1060 1.1034 1.1076 1.0639 1.0665
irintensity: 4.2276 1.9408 0.7545 0.7837 0.1215 0.9681 0.3071 0.4184 3.2040 0.0374 7.2738 3.0376 1.1727 5.2125 9.2865 163.4622 0.8586 10.3953 12.4795 1.2799 56.0508 29.2205 13.6313 0.9631 11.7713 129.9176 6.0865 19.7983 6.5385 0.3117 0.2576 0.6890 5.5660 6.5788 0.9156 37.7482 45.1237 79.2893 171.3465 69.7255 30.1151 130.7404 0.0558 43.9395 47.5131 207.0595 28.3484 18.6138 2.2343 21.0339 29.3764 27.4568 0.1753 82.9490 44.5946 0.3884 0.5811 2.9233 0.0052 1.9467 5.8375 69.6615 16.7083 0.3181 5.7340 44.4101 5.3606 0.0457 0.2108 1.7693 0.3872 24.5958 15.6279 178.6896 202.4003 66.7726 52.3362 0.1179 2.1734 7.4478 0.0887 21.7508 44.8937 60.2446 0.0332 0.4483 0.1535 0.0075 13.8134 66.7601 95.4078 19.4461 2.5367
temp: 298.150 k
press: 1.00000 atm
elementType: 8 8 8 8 8 6 6 6 6 6 6 6 6 6 6 1 1 1 1 1 1 1 1 1 1 1 1 1 1 1 1 1 1
symmnumber: 1
zpe: 716408.3 jmol-1
zpe.correction: 0.272866 hartree
zpe.thermalcorrener: 0.291435 hartree
zpe.thermalcorrenthalpy: 0.292379 hartree
zpe.thermalcorrgfe: 0.218560 hartree
zpe.sumelectzpe: -766.774890 hartree
zpe.sumelectthermal: -766.756320 hartree
zpe.sumelectthermalent: -766.755376 hartree
zpe.sumelectthermalfe: -766.829196 hartree
dipole: 0.9138 -2.0367 0.1385
dipole: 2.2366
quadrupole: -75.9662 -101.3632 -87.5401
quadrupole: -20.9709 0.2225 -0.3611
quadrupole: 12.3237 -13.0734 0.7497 -20.9709 0.2225 -0.3611
hfenergy: -767.0477555 hartree
pointgroup: C01 [X(C10H18O5)]
dipole: -0.3540208 0.8011726 0.0840986 debye
polarizability: 175.367926|-3.950984|116.0162668|0.2876971|0.6510196|87.1552674 unknown
InChI: InChI=1S/C10H18O5/c11-7-3-4-8-15-10(14)6-2-1-5-9(12)13/h11-12H,1-8H2
charge 0 multiplicity 1
33 atoms
O  -1.633242 0.211554 -0.020453
O  -7.83427 0.199434 0.009449
O  -0.527362 -1.838195 -0.096616
O  7.022736 -0.432068 0.078408
O  5.935094 1.617396 0.043211
C  2.064253 -0.552302 0.006561
C  3.318743 0.346759 0.021809
C  0.765575 0.276142 -0.007862
C  -4.039724 0.545292 0.01822
C  -5.443648 -0.102337 -0.025437
C  -2.939945 -0.513263 -0.059299
C  4.615369 -0.484292 0.042246
C  -0.485362 -0.586869 -0.047911
C  -6.562203 0.939019 0.063407
C  5.867919 0.368568 0.05276
H  2.08195 -1.218026 -0.877545
H  2.062121 -1.219386 0.89005
H  3.299142 1.015641 0.903673
H  3.323506 1.010095 -0.864406
H  0.740507 0.956732 -0.881684
H  0.703336 0.933715 0.881156
H  -3.914747 1.127011 0.95197
H  -3.918786 1.254501 -0.82335
H  -5.56419 -0.817813 0.81082
H  -5.573939 -0.676383 -0.963012
H  -2.987677 -1.100591 -0.995168
H  -2.976148 -1.219935 0.790418
H  4.671419 -1.158246 -0.835226
H  4.64989 -1.149307 0.927535
H  -6.475965 1.510999 1.013515
H  -6.483878 1.655779 -0.783661
H  -8.590633 0.836297 0.061945
H  7.82556 0.15748 0.085175
