program: Gaussian 09
title: 000208863
version: EM64L-G09RevD.01
frameworkgroup: C1[X(C14H30O2)]
method: RPBEPBE
basis: SDD
operation: Freq
keyword: #pfreq=noraman
keyword: PBEPBE/SDD
title: #p freq=noraman PBEPBE/SDD
converged: YES YES NO NO
title: Mulliken charges:
elementType: O O C C C C C C C C C C C C C C H H H H H H H H H H H H H H H H H H H H H H H H H H H H H H
charge: -0.276304 -0.257888 -0.429942 -0.357647 0.017493 -0.344426 -0.359912 -0.260122 -0.271476 -0.378643 -0.360865 -0.343803 -0.345817 -0.697442 -0.686999 -0.687078 0.194353 0.203309 0.211366 0.214724 0.183230 0.181342 0.182671 0.196231 0.196895 0.189215 0.180847 0.165262 0.213008 0.206887 0.206589 0.209029 0.229997 0.191095 0.191881 0.189402 0.192412 0.213771 0.208806 0.208428 0.212341 0.212465 0.215962 0.213691 0.210939 0.214722
chargesum: 0.00000
title: Mulliken charges with hydrogens summed into heavy atoms:
elementType: O O C C C C C C C C C C C C C C
charge: -0.276304 -0.257888 -0.032280 0.068444 0.200723 0.019587 0.033214 0.109941 0.106794 0.034833 0.078162 0.039174 0.035997 -0.066437 -0.046231 -0.047727
polarizability: 1.84718443e+02 -1.43880391e-01 1.60181793e+02 -2.99590814e+00 8.07152077e-01 1.42273933e+02
1716.lowfreq: -16.3423 -6.4661 -0.0007 -0.0005 -0.0003 4.0819 7.8961 17.2356 27.6947
frequency: 7.2232 16.0706 27.6625 33.1518 43.1201 55.0194 62.8552 85.2738 98.4914 98.7266 115.6956 118.3024 129.8337 145.7842 169.7572 174.8701 226.1358 228.7510 233.6795 236.4337 269.0989 292.4567 330.0083 362.4649 400.1120 404.9693 425.9882 448.7019 535.4333 666.4142 725.8299 738.8927 741.3844 747.6362 794.5686 803.2369 804.6028 854.3301 872.8633 890.4829 897.8945 903.6539 932.7210 935.3869 965.5680 968.1566 983.1648 1013.9408 1030.6591 1038.9514 1051.9587 1068.4151 1076.7389 1084.7436 1098.6443 1112.9140 1117.9667 1126.3555 1133.7816 1140.5319 1166.8867 1202.7580 1209.3281 1220.2994 1243.2656 1264.1483 1264.5486 1269.6498 1273.1495 1279.2028 1281.4150 1282.6330 1284.8239 1295.9157 1305.6607 1319.4780 1332.1414 1343.4203 1349.1836 1350.8675 1362.9575 1370.4442 1387.3907 1389.0127 1390.8100 1395.0435 1448.0651 1464.1342 1465.0410 1467.8418 1470.6765 1470.8230 1473.7563 1475.8041 1476.6245 1477.9565 1479.6367 1482.4729 1483.8846 1488.9636 1489.9633 1494.9112 2888.3532 2921.3256 2934.7800 2946.6156 2959.4985 2965.3331 2966.9674 2970.1952 2970.5350 2973.8490 2975.4421 2986.9121 2987.9774 2991.4195 2996.5624 2997.3476 3004.1027 3008.4584 3020.5154 3024.1286 3036.0210 3054.1960 3061.0322 3063.8319 3068.2098 3068.7369 3072.3445 3073.4687 3074.0626 3074.5348
redmass: 2.6837 3.0505 3.2218 2.1878 1.6493 3.4009 1.7856 2.6179 2.1654 2.8962 2.5898 2.7335 1.9526 2.3361 3.3606 3.2371 1.2266 1.1279 2.6900 1.1182 2.9363 3.2536 3.2218 3.7015 3.0909 2.9486 3.3595 3.0304 5.1463 4.5030 1.0729 1.0714 1.0739 1.2705 1.2655 1.5692 1.1711 2.5724 1.7927 1.9393 1.7298 1.7936 1.2015 1.1654 1.9355 2.0857 5.3974 3.5135 3.4804 3.6977 3.7242 2.3815 2.3854 2.1805 2.0735 2.3660 2.6572 2.2893 1.6952 1.4309 1.8349 1.4944 1.4039 1.3487 1.3464 1.2379 1.2825 1.2622 1.1850 1.1384 1.1055 1.0846 1.0483 1.1252 1.4741 1.3649 1.1713 1.4729 1.5842 1.5291 1.5708 1.3591 1.2412 1.2174 1.2174 1.3350 1.0852 1.0770 1.0679 1.0740 1.0699 1.0694 1.0628 1.0430 1.0423 1.0429 1.0638 1.0694 1.0703 1.0906 1.0894 1.0883 1.0824 1.0559 1.0638 1.0585 1.0594 1.0587 1.0569 1.0392 1.1039 1.0362 1.0363 1.0609 1.0973 1.0593 1.0625 1.0611 1.0961 1.1005 1.1021 1.0969 1.1009 1.1040 1.1028 1.1029 1.1012 1.1002 1.0999 1.1008 1.1011 1.0996
irintensity: 0.2297 0.2381 0.4398 0.4761 0.0059 0.4382 0.4312 0.6017 0.7175 1.0666 1.4539 0.9140 0.6372 0.3260 0.8284 4.1032 0.3695 0.0961 0.6728 0.0153 0.5818 2.4165 1.3416 0.8025 5.7612 2.3500 1.8465 3.1951 8.3190 3.6294 6.3951 10.7569 5.6488 11.0556 7.4636 28.5552 3.6057 22.6587 45.9986 9.3674 13.9800 28.0439 0.8833 2.6412 21.4760 93.5607 67.2441 13.8489 5.0829 30.4653 82.6725 3.6051 1.5413 10.8780 42.2060 8.9191 20.1348 17.9831 12.8745 1.4254 19.5202 1.0704 0.1983 15.7274 17.7486 2.2713 2.8967 0.2355 1.3800 7.3976 0.8138 0.7261 1.0912 5.6428 19.9363 25.6093 16.3349 1.0492 0.6411 7.0969 8.7675 6.3276 7.8781 12.0937 11.0754 1.3958 5.1096 2.8644 0.3924 0.0800 0.2720 0.6291 0.0676 14.0386 11.3548 11.8872 5.3828 3.0837 2.4542 17.9964 32.5936 4.0992 43.7814 36.7678 79.4005 22.2380 45.6207 40.7044 58.6159 38.5992 51.0863 27.1002 34.4654 16.8981 5.8884 38.6279 18.7082 74.6796 18.3025 6.6668 25.7807 18.9836 0.5601 31.4777 8.3593 0.8124 108.9638 84.7134 109.3397 118.5389 46.3139 60.7388
temp: 298.150 k
press: 1.00000 atm
elementType: 8 8 6 6 6 6 6 6 6 6 6 6 6 6 6 6 1 1 1 1 1 1 1 1 1 1 1 1 1 1 1 1 1 1 1 1 1 1 1 1 1 1 1 1 1 1
symmnumber: 1
zpe: 1092670.3 jmol-1
zpe.correction: 0.416176 hartree
zpe.thermalcorrener: 0.438296 hartree
zpe.thermalcorrenthalpy: 0.439240 hartree
zpe.thermalcorrgfe: 0.359546 hartree
zpe.sumelectzpe: -700.550894 hartree
zpe.sumelectthermal: -700.528774 hartree
zpe.sumelectthermalent: -700.527830 hartree
zpe.sumelectthermalfe: -700.607524 hartree
dipole: -2.2999 0.5830 -1.3045
dipole: 2.7076
quadrupole: -101.8087 -100.8637 -101.1769
quadrupole: 1.0607 1.1303 -1.3090
quadrupole: -0.5256 0.4194 0.1062 1.0607 1.1303 -1.3090
hfenergy: -700.9670697 hartree
pointgroup: C01 [X(C14H30O2)]
dipole: 0.7111744 0.6623412 -0.4362342 debye
polarizability: 166.1615652|10.5860913|177.9646399|4.7589796|3.6777822|143.0479642 unknown
InChI: InChI=1S/C14H30O2/c1-4-7-10-11-14(15-12-8-5-2)16-13-9-6-3/h14H,4-13H2,1-3H3
charge 0 multiplicity 1
46 atoms
O  0.504487 -0.132573 -0.370909
O  -1.683758 0.61479 -1.135018
C  -1.004407 -1.646657 -1.548541
C  -1.607118 -2.207713 -0.241689
C  -0.517855 -0.198377 -1.430851
C  -2.057674 -3.677927 -0.387108
C  -2.674807 -4.252295 0.908568
C  1.709376 0.650345 -0.696934
C  -1.470505 2.07401 -1.123002
C  2.703272 0.463147 0.453571
C  -1.21503 2.619988 0.29264
C  4.031451 1.219923 0.218376
C  -1.046569 4.157379 0.302156
C  -3.119448 -5.724233 0.766586
C  5.032163 1.028167 1.378255
C  -0.836444 4.721753 1.724018
H  -0.141485 -2.266555 -1.861702
H  -1.758305 -1.689443 -2.358829
H  -0.855262 -2.121868 0.566182
H  -2.46666 -1.577326 0.054857
H  -0.054661 0.16007 -2.382588
H  -1.190653 -4.304787 -0.686372
H  -2.799168 -3.760195 -1.210252
H  -1.936707 -4.164438 1.731808
H  -3.543283 -3.628635 1.203536
H  2.150426 0.289419 -1.652654
H  1.459728 1.727643 -0.81919
H  -0.637283 2.343338 -1.810228
H  -2.403277 2.506172 -1.532438
H  2.232315 0.809447 1.394073
H  2.901615 -0.619123 0.577268
H  -2.068409 2.331615 0.936811
H  -0.321327 2.129791 0.721539
H  3.823416 2.301558 0.085101
H  4.491913 0.871208 -0.728682
H  -0.184916 4.441192 -0.337626
H  -1.940653 4.630456 -0.153948
H  -3.561741 -6.107623 1.704834
H  -3.876182 -5.833855 -0.033465
H  -2.262079 -6.373943 0.506863
H  4.607717 1.394978 2.33158
H  5.2818 -0.041002 1.512719
H  5.974517 1.575626 1.193752
H  -1.697819 4.481449 2.374901
H  0.067106 4.288282 2.192544
H  -0.717717 5.820826 1.71039
