program: Gaussian 09
title: 000208862
version: EM64L-G09RevD.01
frameworkgroup: C1[X(C16H34O2)]
method: RPBEPBE
basis: SDD
operation: Freq
keyword: #pfreq=noraman
keyword: PBEPBE/SDD
title: #p freq=noraman PBEPBE/SDD
converged: YES YES NO NO
title: Mulliken charges:
elementType: O O C C C C C C C C C C C C C C C C H H H H H H H H H H H H H H H H H H H H H H H H H H H H H H H H H H
charge: -0.276384 -0.261120 0.025915 -0.433050 -0.359247 -0.418008 -0.423989 -0.341868 -0.029529 -0.031229 -0.300423 -0.256598 -0.361314 -0.711920 -0.711836 -0.709756 -0.713943 -0.697172 0.181687 0.193903 0.202722 0.215810 0.209948 0.214639 0.212193 0.214814 0.208469 0.180872 0.182673 0.205086 0.203406 0.203225 0.210848 0.184885 0.226013 0.197084 0.196340 0.213738 0.203988 0.215151 0.206391 0.212914 0.217100 0.212252 0.203315 0.215683 0.206051 0.210977 0.218272 0.213863 0.208268 0.208894
chargesum: 0.00000
title: Mulliken charges with hydrogens summed into heavy atoms:
elementType: O O C C C C C C C C C C C C C C C C
charge: -0.276384 -0.261120 0.207602 -0.036426 0.066512 0.008824 -0.000705 0.021677 0.175556 0.172176 0.113650 0.154300 0.032110 -0.079043 -0.075432 -0.078506 -0.078643 -0.066147
polarizability: 2.07798206e+02 -3.31971076e-01 1.86913637e+02 1.65478660e+00 -5.99058382e-01 1.57187806e+02
1716.lowfreq: -12.0498 -8.1180 -0.0006 -0.0005 0.0010 4.6203 9.4985 19.0593 19.2859
frequency: -4.4083 18.2728 18.8776 22.0215 32.1862 38.4948 65.0193 79.8389 93.9446 98.5917 107.6886 116.7399 126.0219 130.2546 141.5365 164.8080 206.9138 213.3499 217.6184 233.8351 237.0911 248.5311 258.3011 283.0395 331.2694 345.7734 355.0253 356.5257 359.6680 371.6248 409.8313 426.3504 509.4552 530.8133 558.5833 679.1771 724.4651 747.3735 784.0360 786.8618 787.6666 793.1678 813.3248 861.8375 888.3122 892.1479 912.6340 913.9648 951.9130 952.3658 962.7201 965.4416 969.9853 970.9311 980.0649 988.9511 990.5333 1014.9077 1022.2088 1032.6304 1046.5076 1079.7360 1101.1917 1120.8309 1132.0862 1140.7842 1142.5303 1147.7672 1148.9304 1192.9305 1194.2079 1199.7975 1204.3651 1209.2463 1240.9394 1262.4965 1274.8091 1281.2737 1283.2975 1284.4129 1284.9975 1292.3533 1305.1625 1315.4574 1328.4551 1332.0395 1332.1123 1342.8290 1349.5723 1352.2339 1366.0290 1376.1841 1377.2560 1382.6099 1386.8678 1394.8627 1395.0815 1399.5269 1447.1323 1463.1642 1463.4570 1464.1720 1466.0619 1467.0096 1469.7476 1474.1004 1476.5349 1477.1228 1481.9334 1483.1871 1484.9011 1487.4746 1488.2034 1488.6641 1489.7159 1496.7365 2881.2140 2921.5905 2943.3376 2945.3304 2962.9996 2964.7576 2966.9015 2968.1350 2968.6783 2969.3120 2971.7709 2972.6961 2983.4721 2987.1289 2989.1986 2989.6585 2991.7882 2995.4840 3005.0036 3020.0591 3032.2817 3047.7349 3048.7058 3059.6710 3061.2151 3062.2612 3066.6330 3067.3397 3067.5905 3067.8435 3067.9240 3069.0194 3070.6667 3070.8644
redmass: 2.6341 3.0731 3.6857 2.8526 2.7996 1.8897 3.3781 2.9773 2.6633 2.3416 2.3362 2.2513 2.0000 2.5790 3.0478 3.4812 1.1909 1.8171 1.3284 1.1069 1.0824 1.2063 2.6686 3.5057 3.5239 2.6328 2.0399 2.1703 2.3533 2.3909 3.0164 3.0825 3.3749 2.7356 3.1148 4.2440 1.0732 1.2663 2.2874 1.7758 1.6138 1.2367 1.7954 2.3170 2.1866 2.0606 1.1879 1.1865 1.3131 1.3022 1.6266 2.0455 3.6793 1.5482 3.3457 1.7138 1.7280 2.5228 2.1577 2.8821 3.5797 2.3457 2.1077 2.4212 1.6860 2.0013 1.8463 1.7315 1.8273 1.8804 1.8729 1.3294 1.4383 1.2344 1.3532 1.2420 1.2726 1.2754 1.1155 1.1577 1.3717 1.1314 1.5116 1.3256 1.3008 1.4593 1.4589 1.3568 1.4886 1.3973 1.5454 1.2138 1.2108 1.4640 1.2200 1.2208 1.2225 1.3634 1.0848 1.0814 1.0719 1.0758 1.0451 1.0483 1.0726 1.0543 1.0542 1.0430 1.0710 1.0735 1.0544 1.0503 1.0872 1.0533 1.0660 1.0797 1.0828 1.0624 1.0549 1.0586 1.0806 1.0801 1.0552 1.0354 1.0358 1.0399 1.0360 1.0359 1.0600 1.0987 1.0660 1.0652 1.0996 1.0593 1.0951 1.1021 1.1010 1.1037 1.1037 1.0997 1.0997 1.1032 1.1000 1.0996 1.1018 1.0991 1.0991 1.0987 1.0990 1.0991
irintensity: 0.0161 0.0072 0.0276 0.0093 0.3520 0.0993 0.8958 0.8576 0.0761 1.9273 0.5905 0.1731 0.3593 0.5132 4.7899 3.6728 0.1214 0.8166 0.2098 0.0146 0.1034 1.0394 4.0619 3.0443 1.5322 0.2901 0.0996 0.0796 0.1932 0.7314 2.4526 2.4100 0.4537 4.7124 8.1387 0.6680 7.0644 6.5847 4.1074 4.6373 0.7177 2.3972 24.4287 60.0977 18.1806 22.5122 2.2729 2.1368 3.7498 0.0512 3.4101 41.6275 113.3328 14.6183 63.8725 5.1609 6.5033 12.0086 26.2363 2.1686 91.9189 1.6525 38.5758 28.0254 16.4194 4.6025 6.3629 4.9217 17.9016 7.7077 7.4282 0.8885 4.4567 0.8014 17.7392 2.3797 0.7755 1.6731 0.9379 0.2638 2.6761 3.5975 25.5199 31.5744 25.7269 1.7026 2.4036 4.0176 1.8211 5.6625 4.4341 20.5440 21.1237 1.8814 13.0064 7.2161 20.1276 1.3813 5.6755 5.0327 2.6111 1.8539 1.4621 1.6405 0.8631 3.4143 2.6392 11.7376 2.7777 9.2204 23.3067 23.1444 16.2358 9.1090 17.5131 1.3431 49.7598 38.2172 61.4408 23.5324 18.5159 18.7281 58.7611 37.2665 32.5309 28.9236 26.1530 28.9105 23.1507 5.7657 31.6214 44.0700 37.7616 53.7086 29.9877 25.1840 1.2204 44.2112 42.4031 11.3433 10.7282 3.7169 27.7884 35.6931 187.5983 20.6852 108.7842 84.5655 39.5675 115.1871
temp: 298.150 k
press: 1.00000 atm
elementType: 8 8 6 6 6 6 6 6 6 6 6 6 6 6 6 6 6 6 1 1 1 1 1 1 1 1 1 1 1 1 1 1 1 1 1 1 1 1 1 1 1 1 1 1 1 1 1 1 1 1 1 1
symmnumber: 1
zpe: 1237685.6 jmol-1
zpe.correction: 0.471410 hartree
zpe.thermalcorrener: 0.495284 hartree
zpe.thermalcorrenthalpy: 0.496228 hartree
zpe.thermalcorrgfe: 0.414443 hartree
zpe.sumelectzpe: -778.997235 hartree
zpe.sumelectthermal: -778.973361 hartree
zpe.sumelectthermalent: -778.972417 hartree
zpe.sumelectthermalfe: -779.054202 hartree
dipole: 2.2792 0.7682 -0.9343
dipole: 2.5803
quadrupole: -116.4049 -111.9467 -115.1273
quadrupole: -0.5779 1.0288 -0.9951
quadrupole: -1.9119 2.5463 -0.6344 -0.5779 1.0288 -0.9951
hfenergy: -779.4686448 hartree
pointgroup: C01 [X(C16H34O2)]
dipole: 0.2242285 0.9164753 -0.3746773 debye
polarizability: 193.0181123|9.5314692|201.664514|1.8321076|0.7252893|157.2170221 unknown
InChI: InChI=1S/C16H34O2/c1-6-7-8-9-16(17-12-10-14(2)3)18-13-11-15(4)5/h14-16H,6-13H2,1-5H3
charge 0 multiplicity 1
52 atoms
O  -1.038849 0.295702 -0.038378
O  0.897993 -1.065769 -0.492515
C  -0.373875 -0.591516 -1.008958
C  -1.249454 -1.820302 -1.267138
C  -1.583291 -2.632213 0.003728
C  -1.667136 2.485299 0.760367
C  3.183543 -0.667709 0.186962
C  -2.476449 -3.853598 -0.305279
C  -1.839687 4.015162 0.540047
C  4.372454 0.303136 0.441605
C  -1.12898 1.710958 -0.449069
C  1.881764 0.007751 -0.259525
C  -2.827133 -4.68583 0.949471
C  -0.495131 4.726319 0.244463
C  -2.890966 4.343177 -0.549403
C  4.840301 1.017386 -0.850856
C  4.071061 1.327926 1.563673
C  -3.713422 -5.909962 0.632668
H  -0.19523 -0.011674 -1.948015
H  -2.185276 -1.472075 -1.747151
H  -0.722603 -2.465605 -1.997705
H  -0.639187 -2.96349 0.476087
H  -2.087459 -1.967913 0.731764
H  -2.641494 2.041909 1.044152
H  -0.978824 2.310516 1.610579
H  2.970597 -1.239131 1.111385
H  3.472635 -1.405975 -0.586326
H  -3.416328 -3.513065 -0.790114
H  -1.966146 -4.508335 -1.043618
H  -2.22294 4.419478 1.500564
H  5.214778 -0.331155 0.789978
H  -0.128171 2.085151 -0.751028
H  -1.811688 1.803839 -1.319841
H  2.02415 0.583384 -1.202095
H  1.493062 0.692667 0.519483
H  -1.888709 -5.022063 1.435568
H  -3.341369 -4.03461 1.685448
H  -0.625797 5.824337 0.234997
H  -0.091423 4.433319 -0.743161
H  0.265207 4.480652 1.009737
H  -2.542298 4.039795 -1.554677
H  -3.094191 5.429693 -0.584143
H  -3.847796 3.824578 -0.35122
H  5.764163 1.596881 -0.666831
H  4.075602 1.724701 -1.224078
H  5.050566 0.28896 -1.656528
H  3.291892 2.049462 1.252876
H  4.9771 1.908497 1.819205
H  3.718326 0.824023 2.483003
H  -3.954131 -6.485354 1.545799
H  -4.668112 -5.597688 0.167955
H  -3.205851 -6.593824 -0.074009
