program: Gaussian 09
title: 000208860
version: EM64L-G09RevD.01
frameworkgroup: C1[X(C16H16N4O5)]
method: RPBEPBE
basis: SDD
operation: Freq
keyword: #p
keyword: freq=noraman
keyword: PBEPBE/SDD
title: #p freq=noraman PBEPBE/SDD
converged: YES YES NO NO
title: Mulliken charges:
elementType: O O O O O N N N N C C C C C C C C C C C C C C C C H H H H H H H H H H H H H H H H
charge: -0.258025 -0.247397 -0.416310 -0.228812 -0.167392 0.017370 -0.142797 -0.362963 -0.007114 -0.356693 -0.406552 -0.370303 -0.311959 -0.486245 0.336538 0.420520 -0.520419 0.149549 -0.351792 -0.358531 -0.325053 0.174009 0.185977 0.066397 -0.054971 0.190819 0.190864 0.220515 0.220628 0.222497 0.219966 0.209527 0.209616 0.252129 0.252727 0.263644 0.264233 0.294815 0.270078 0.377869 0.363040
chargesum: 0.00000
title: Mulliken charges with hydrogens summed into heavy atoms:
elementType: O O O O O N N N N C C C C C C C C C C C C C C C C
charge: -0.258025 -0.247397 -0.038441 -0.228812 -0.167392 0.017370 -0.142797 0.000077 -0.007114 0.024990 0.034591 0.072160 0.107185 0.018611 0.336538 0.420520 -0.256775 0.149549 -0.087560 -0.063716 -0.054975 0.174009 0.185977 0.066397 -0.054971
polarizability: 3.74165794e+02 -4.98512965e+01 2.51227193e+02 9.85428845e-01 5.51293833e-01 1.05278618e+02
1716.lowfreq: -0.5490 -0.0009 0.0008 0.0012 4.5311 7.1073 13.5302 18.0652 23.9120
frequency: 13.5071 17.8079 23.8955 36.7039 43.9681 57.2815 63.2882 70.4909 83.9044 108.0405 113.2189 132.2990 150.1632 162.4313 180.1566 186.8804 191.3617 264.1583 282.2855 325.3794 326.7857 350.0468 370.2700 370.7192 437.3563 442.8785 460.0335 470.7519 501.1792 506.4671 541.9531 584.3906 590.8200 597.3437 623.9236 634.9541 639.9084 696.5877 703.0908 726.0599 730.0129 737.7231 755.0219 762.6984 771.4534 833.5631 839.8056 840.7409 851.4697 856.0056 860.5194 904.7775 930.5705 940.0367 956.3973 961.0872 967.9214 976.6123 998.2450 1012.3673 1045.5416 1062.7055 1068.3486 1085.5390 1109.9657 1112.6963 1116.2522 1117.8707 1137.6494 1155.9201 1176.8181 1198.6331 1211.2079 1226.9957 1230.2078 1259.7518 1265.9385 1266.2242 1275.6074 1292.0456 1295.9190 1311.6625 1352.1658 1358.6216 1377.7125 1384.6315 1398.8914 1409.8469 1417.5362 1438.0729 1466.8200 1468.3039 1475.0027 1482.5043 1486.7639 1491.1849 1568.9834 1601.4383 1621.9782 1669.5753 1684.3936 2944.6478 2956.8562 2988.6226 2997.2781 3001.4017 3001.7300 3003.1246 3033.5767 3059.9312 3070.7557 3144.9698 3158.5857 3163.7638 3183.8294 3513.4731 3607.4308
redmass: 9.2985 8.1978 7.7191 8.9194 4.9526 2.8179 2.5441 6.3463 4.6772 3.3502 8.1303 1.9282 2.4644 6.7797 5.8955 5.9349 7.9826 8.4557 7.5265 4.6344 7.0745 6.8863 5.9217 5.3457 4.9243 6.6347 3.5022 4.8024 1.9863 3.2692 8.7728 6.2304 5.2691 3.3707 7.5263 9.5719 1.3113 7.8147 8.4161 1.1687 1.1111 3.4995 7.2085 8.5760 1.1968 1.4587 8.8350 1.4521 7.2098 1.4519 4.9148 5.6582 9.8420 6.1866 1.2942 1.3638 1.4359 4.0040 9.7281 3.9922 3.1947 2.8379 5.8586 2.1373 2.6421 1.6269 2.4399 3.3048 5.7167 1.2591 2.0253 3.1440 4.2873 1.3310 1.3295 1.5835 1.6194 2.0655 1.1656 1.0710 1.1018 1.4830 1.9309 1.6544 1.8274 1.5633 3.4174 1.9740 7.8955 1.0853 1.0864 1.1396 1.4950 1.6063 4.2587 1.2938 7.9095 7.0935 6.6788 8.2855 12.8031 1.0550 1.0590 1.0614 1.0601 1.0797 1.0789 1.1067 1.0990 1.1043 1.1041 1.0926 1.0914 1.0885 1.0977 1.0640 1.0846
irintensity: 1.8723 0.0006 0.1570 5.8523 0.4837 0.2562 0.5749 0.7454 0.5051 1.0448 1.7795 0.0561 2.0489 0.2486 0.1428 5.8991 4.7249 3.9507 0.0371 2.8899 6.0635 0.1678 1.2101 2.9679 0.8873 24.3720 9.6674 0.9970 23.4581 12.9426 4.4764 1.3487 16.2335 4.1153 27.1599 7.7702 131.0918 8.6319 0.5894 112.3267 20.0426 7.8566 22.8996 13.6251 0.0390 38.7179 64.4009 27.8579 34.0850 4.7781 7.5048 10.3170 13.0677 23.6532 0.7916 3.6881 19.9400 47.0046 2.9518 277.2611 15.3827 77.6054 2.7702 0.2189 20.3344 3.0365 30.5055 12.9123 0.2050 1.4084 187.8923 18.1943 15.0299 0.3243 10.0783 29.2436 21.7211 293.8660 0.1272 0.1860 0.6569 15.8020 6.3203 7.4363 24.0790 50.4806 41.1484 26.9225 12.0069 27.9513 4.9065 24.3526 61.4594 25.0966 38.9492 24.6425 189.9107 26.2939 12.1589 211.3814 483.1255 17.4159 28.7855 6.0408 0.8232 37.5005 39.7927 12.6776 0.0960 0.0324 100.0296 0.7177 10.3195 0.4920 2.5606 21.5743 167.8402
temp: 298.150 k
press: 1.00000 atm
elementType: 8 8 8 8 8 7 7 7 7 6 6 6 6 6 6 6 6 6 6 6 6 6 6 6 6 1 1 1 1 1 1 1 1 1 1 1 1 1 1 1 1
symmnumber: 1
zpe: 804953.3 jmol-1
zpe.correction: 0.306591 hartree
zpe.thermalcorrener: 0.329585 hartree
zpe.thermalcorrenthalpy: 0.330529 hartree
zpe.thermalcorrgfe: 0.248913 hartree
zpe.sumelectzpe: -1212.572251 hartree
zpe.sumelectthermal: -1212.549257 hartree
zpe.sumelectthermalent: -1212.548312 hartree
zpe.sumelectthermalfe: -1212.629928 hartree
dipole: 3.9223 3.1059 0.0581
dipole: 5.0035
quadrupole: -157.1452 -148.0508 -144.0749
quadrupole: -6.9358 0.0266 -0.1925
quadrupole: -7.3883 1.7062 5.6821 -6.9358 0.0266 -0.1925
hfenergy: -1212.8788412 hartree
pointgroup: C01 [X(C16H16N4O5)]
dipole: 1.5296578 -1.2349923 -0.1000545 debye
polarizability: 375.2548374|48.3557963|249.3743753|3.4614409|10.5426483|106.0423926 unknown
InChI: InChI=1S/C16H16N4O5/c21-14(22)4-2-1-3-7-24-11-5-6-13-10(8-11)9-12(16(23)25-13)15-17-19-20-18-15/h5-6,8-9,19,21H,1-4,7H2
charge 0 multiplicity 1
41 atoms
O  1.771766 1.808144 0.046667
O  -3.821872 2.17561 0.094944
O  9.416542 -2.371773 -0.181572
O  9.251979 -0.065249 0.031785
O  -5.955558 1.321349 0.041951
N  -6.298364 -1.54151 -0.18052
N  -4.34156 -2.762203 -0.269115
N  -6.500626 -2.891161 -0.279172
N  -5.343828 -3.66142 -0.335847
C  4.83393 -0.465048 -0.069735
C  3.980144 0.822441 -0.016036
C  6.348185 -0.162001 -0.057254
C  2.481936 0.515742 -0.03755
C  7.195445 -1.447248 -0.104196
C  0.373372 1.783833 0.049718
C  -1.838983 0.732957 -0.019981
C  -0.416173 0.621966 -0.033211
C  -2.435228 2.022437 0.077764
C  -0.246822 3.066851 0.146489
C  -2.716342 -0.403632 -0.101817
C  -1.642703 3.189278 0.160899
C  8.687258 -1.175233 -0.074232
C  -4.09985 -0.275613 -0.0870
C  -4.745299 1.048252 0.015605
C  -4.925337 -1.481587 -0.175297
H  4.580218 -1.114943 0.79395
H  4.580144 -1.042933 -0.983239
H  4.225576 1.476552 -0.874123
H  4.214621 1.394102 0.902032
H  6.609345 0.417212 0.848598
H  6.609676 0.482881 -0.917731
H  2.191743 -0.120083 0.825502
H  2.19305 -0.003096 -0.975883
H  6.95821 -2.111917 0.750228
H  6.97657 -2.041674 -1.01264
H  0.030637 -0.373723 -0.109113
H  0.398384 3.948024 0.209522
H  -2.293233 -1.411537 -0.179516
H  -2.13108 4.164521 0.235294
H  10.39031 -2.164778 -0.153662
H  -7.433179 -3.302093 -0.30931
