program: Gaussian 09
title: 000208859
version: EM64L-G09RevD.01
frameworkgroup: C1[X(C16H16N4O5)]
method: RPBEPBE
basis: SDD
operation: Freq
keyword: #p
keyword: freq=noraman
keyword: PBEPBE/SDD
title: #p freq=noraman PBEPBE/SDD
converged: YES YES NO NO
title: Mulliken charges:
elementType: O O O O O N N N N C C C C C C C C C C C C C C C C H H H H H H H H H H H H H H H H
charge: -0.257274 -0.261958 -0.416245 -0.230520 -0.164549 0.012035 -0.144560 -0.363694 -0.008314 -0.351821 -0.417033 -0.361764 -0.313203 -0.488952 0.376972 0.394522 0.200726 -0.486725 -0.400278 -0.373049 -0.366884 0.173865 0.188639 0.065138 -0.052250 0.219721 0.186009 0.203221 0.222548 0.219232 0.213644 0.213135 0.229229 0.254255 0.252467 0.289765 0.259545 0.248572 0.297508 0.377117 0.361209
chargesum: 0.00000
title: Mulliken charges with hydrogens summed into heavy atoms:
elementType: O O O O O N N N N C C C C C C C C C C C C C C C C
charge: -0.257274 -0.261958 -0.039127 -0.230520 -0.164549 0.012035 -0.144560 -0.002485 -0.008314 0.053909 0.008737 0.071111 0.129161 0.017770 0.376972 0.394522 0.200726 -0.196960 -0.140733 -0.124477 -0.069376 0.173865 0.188639 0.065138 -0.052250
polarizability: 4.33225365e+02 1.67950031e+00 1.95876312e+02 3.68511942e+01 1.24909663e+01 1.26757168e+02
1716.lowfreq: -5.4589 -2.6022 -0.0015 0.0004 0.0006 6.3520 11.4493 13.9303 17.4813
frequency: 11.4356 13.9216 17.4770 34.9364 37.6277 53.5363 68.8319 82.8125 92.3788 95.9532 106.2023 124.6398 131.5982 161.2064 226.7008 236.9232 250.6490 252.9952 268.5331 278.6686 328.1327 350.8197 397.3602 410.7137 431.8111 438.7475 450.9488 462.2073 492.5337 500.6095 559.0827 575.3960 594.2011 607.1872 628.0903 632.2746 637.3083 700.9582 705.7285 723.1263 730.2294 743.1738 753.6972 761.4948 791.2790 801.3261 821.5289 846.0176 846.9941 857.5173 874.8784 905.6410 907.0120 933.8887 940.5916 950.8878 972.7700 976.2633 997.8894 1006.1183 1043.2176 1066.7331 1071.4187 1081.7505 1103.5599 1108.4810 1112.4777 1114.7191 1138.4798 1154.8577 1165.6461 1197.2578 1212.4051 1234.1842 1237.3914 1247.0307 1257.0644 1276.1671 1277.5930 1287.4559 1293.8282 1327.8927 1362.1010 1370.2087 1374.2203 1376.4428 1387.1168 1408.5142 1434.1727 1437.0114 1451.6160 1468.3320 1468.5203 1477.6380 1484.5733 1504.7769 1551.5282 1605.4517 1622.3871 1669.0304 1693.4715 2961.8686 2964.6889 2983.6859 2986.7727 2995.0639 3018.3682 3028.1490 3033.2562 3048.9348 3065.2959 3143.1702 3146.1528 3179.0860 3187.6515 3512.3408 3608.8769
redmass: 8.2646 10.4505 7.7530 6.7257 7.6592 3.1517 2.7734 5.4657 3.9862 5.8380 5.2540 2.4689 4.5026 7.2005 2.6138 5.0419 7.6072 5.0656 5.4049 6.5526 6.3321 5.7595 5.3238 6.4454 3.9668 4.5554 5.8076 3.2635 4.0810 1.7847 7.1104 5.2018 4.1211 8.6757 4.2424 8.8740 1.3209 8.3272 4.1103 1.1733 1.2464 3.3436 2.6858 8.8018 2.2384 5.8187 1.4546 4.6256 2.9845 1.9805 2.3066 2.8422 3.6668 11.8001 1.9672 1.3364 3.1070 1.4401 9.7534 3.6823 2.2475 4.9923 2.4976 2.1802 2.4584 1.9125 2.1482 4.4403 6.3207 1.4057 1.8824 2.6724 1.2347 2.0178 1.8545 1.3557 2.0574 1.3708 1.6834 1.0801 1.1597 1.5160 1.8023 1.6738 1.8366 1.7254 4.1171 1.7235 6.4227 1.0847 1.0817 1.0929 1.5554 2.3191 1.0981 3.8769 9.2890 6.8069 7.1626 8.2660 12.5498 1.0567 1.0620 1.0619 1.0617 1.0605 1.0948 1.1030 1.1015 1.1029 1.1032 1.0902 1.0925 1.0959 1.0919 1.0640 1.0846
irintensity: 0.2336 1.2733 0.0858 4.6094 2.9571 0.2960 0.1843 0.9680 0.4375 0.4811 2.0798 1.2309 3.7149 2.2816 5.4401 0.7065 0.0603 0.2077 1.3234 1.3034 7.8003 4.6325 4.3861 0.7391 2.4595 0.8223 1.8834 8.5249 44.9186 28.8614 3.7697 7.5620 36.9760 6.9976 4.1352 11.2871 128.6281 4.4350 2.9199 116.6613 12.8427 2.2300 18.7429 12.3650 17.5255 4.8728 25.6341 25.7487 27.2405 31.8166 13.6560 17.6201 5.3420 23.6984 27.9873 8.5743 81.5920 13.2295 5.0720 168.2272 120.2425 0.5106 6.0696 52.9097 36.4202 33.5075 39.9135 69.3659 11.3345 4.8043 129.2393 85.2757 26.6786 162.5798 82.9647 2.9877 26.6555 32.9799 132.7433 1.3090 35.6232 26.4743 58.6387 4.2453 26.1215 28.0252 33.8145 7.1887 9.4583 33.0025 4.6290 5.0289 51.4757 22.7193 20.6239 104.2855 83.8954 144.4850 645.1154 212.8708 347.0433 15.3780 22.2370 19.1637 9.4798 39.0352 1.7926 23.4973 17.2087 9.9652 85.1181 4.3857 0.9306 4.3447 4.0291 20.9266 168.8841
temp: 298.150 k
press: 1.00000 atm
elementType: 8 8 8 8 8 7 7 7 7 6 6 6 6 6 6 6 6 6 6 6 6 6 6 6 6 1 1 1 1 1 1 1 1 1 1 1 1 1 1 1 1
symmnumber: 1
zpe: 805167.8 jmol-1
zpe.correction: 0.306672 hartree
zpe.thermalcorrener: 0.329569 hartree
zpe.thermalcorrenthalpy: 0.330514 hartree
zpe.thermalcorrgfe: 0.248717 hartree
zpe.sumelectzpe: -1212.576911 hartree
zpe.sumelectthermal: -1212.554014 hartree
zpe.sumelectthermalent: -1212.553070 hartree
zpe.sumelectthermalfe: -1212.634866 hartree
dipole: -2.9471 -1.6064 0.1989
dipole: 3.3624
quadrupole: -141.3452 -152.6237 -146.7390
quadrupole: -0.7627 -8.9823 -1.3133
quadrupole: 5.5574 -5.7211 0.1636 -0.7627 -8.9823 -1.3133
hfenergy: -1212.8835834 hartree
pointgroup: C01 [X(C16H16N4O5)]
dipole: 1.1589224 -0.6102003 0.1857597 debye
polarizability: 434.4172931|12.3492719|172.8249607|29.0512903|-35.2571301|148.6165911 unknown
InChI: InChI=1S/C16H16N4O5/c21-14(22)4-2-1-3-7-24-11-6-5-10-8-12(15-17-19-20-18-15)16(23)25-13(10)9-11/h5-6,8-9,19,21H,1-4,7H2
charge 0 multiplicity 1
41 atoms
O  2.123157 0.490393 0.70271
O  -2.406127 1.354349 -0.848128
O  9.257426 -1.988751 -0.844383
O  9.304716 0.110547 0.14609
O  -4.515949 1.828033 -1.632954
N  -6.74667 0.241828 -0.669354
N  -6.188438 -1.427845 0.823341
N  -7.82087 -0.492546 -0.244078
N  -7.524404 -1.508991 0.657118
C  4.906784 0.360436 -0.400216
C  4.177186 1.627373 0.097343
C  6.426958 0.422803 -0.138783
C  2.665508 1.593879 -0.129031
C  7.149782 -0.845378 -0.629578
C  0.756582 0.243711 0.665714
C  -1.99795 -0.448701 0.757716
C  -1.523209 0.618214 -0.063537
C  -0.162457 0.975355 -0.121936
C  0.313617 -0.83031 1.500026
C  -1.039869 -1.165163 1.540294
C  -3.400872 -0.735309 0.748788
C  8.645872 -0.809521 -0.385091
C  -4.30475 -0.013558 -0.027273
C  -3.853675 1.091997 -0.886564
C  -5.723713 -0.366937 0.018431
H  4.472287 -0.524979 0.102857
H  4.71981 0.232066 -1.487236
H  4.5762 2.520362 -0.425273
H  4.372818 1.775049 1.17708
H  6.616855 0.557398 0.943297
H  6.863013 1.309803 -0.637605
H  2.420748 1.396482 -1.192929
H  2.188629 2.544193 0.183774
H  6.747478 -1.751278 -0.134975
H  6.988293 -1.004033 -1.714144
H  0.133682 1.801779 -0.771166
H  1.058226 -1.367456 2.093369
H  -1.383445 -1.987039 2.177985
H  -3.791871 -1.548883 1.370131
H  10.236834 -1.937496 -0.671161
H  -8.770186 -0.307073 -0.565867
