program: Gaussian 09
title: 000208858
version: EM64L-G09RevD.01
frameworkgroup: C1[X(C16H16N4O5)]
method: RPBEPBE
basis: SDD
operation: Freq
keyword: #p
keyword: freq=noraman
keyword: PBEPBE/SDD
title: #p freq=noraman PBEPBE/SDD
converged: YES YES NO NO
title: Mulliken charges:
elementType: O O O O O N N N N C C C C C C C C C C C C C C C C H H H H H H H H H H H H H H H H
charge: -0.270718 -0.295084 -0.416889 -0.233250 -0.177592 0.013699 -0.140918 -0.362279 -0.005153 -0.381487 -0.406409 -0.373702 -0.312217 -0.480572 0.245470 0.055518 0.442939 -0.368023 -0.361815 -0.430209 0.199276 -0.221687 0.173277 0.078141 -0.050216 0.229098 0.198011 0.227799 0.213907 0.231304 0.211116 0.236033 0.239788 0.258352 0.248697 0.263649 0.296668 0.248515 0.238244 0.375413 0.363307
chargesum: 0.00000
title: Mulliken charges with hydrogens summed into heavy atoms:
elementType: O O O O O N N N N C C C C C C C C C C C C C C C C
charge: -0.270718 -0.295084 -0.041475 -0.233250 -0.177592 0.013699 -0.140918 0.001028 -0.005153 0.045623 0.035298 0.068718 0.163604 0.026476 0.245470 0.055518 0.442939 -0.104374 -0.065148 -0.181694 0.199276 0.016557 0.173277 0.078141 -0.050216
polarizability: 2.70700983e+02 -1.65061068e+01 3.21583935e+02 1.64296504e+01 3.24415522e+00 1.12196534e+02
1716.lowfreq: -7.7448 -3.2909 -0.0006 -0.0003 0.0007 4.0012 9.2794 15.9900 17.6625
frequency: 7.5738 15.8136 17.4102 35.0753 37.9689 43.8012 67.3560 87.2956 94.3390 96.3613 110.4537 143.7948 156.2083 176.3238 188.9045 252.0204 261.9464 269.0176 284.6002 290.3728 335.7317 341.5506 347.1906 385.3009 429.5670 436.7927 483.6387 492.0296 502.5402 537.9258 545.6774 570.1546 583.4561 587.8230 603.9396 634.9355 639.7917 661.9175 701.6276 722.4044 726.7060 731.4113 756.9426 762.2597 784.5464 791.8534 822.6519 832.4306 855.7019 864.2268 889.5675 905.4659 913.2721 934.0260 940.9652 963.6193 964.9530 976.4643 998.7975 1029.0434 1036.9774 1057.7809 1072.4405 1090.1380 1093.2533 1100.3958 1113.9459 1118.6478 1139.0034 1167.6704 1177.3025 1188.3390 1204.0994 1222.7233 1240.7337 1247.0203 1261.0536 1267.5064 1283.6728 1294.4149 1300.2191 1322.5029 1354.2818 1360.8689 1374.3707 1378.1946 1398.9438 1409.1354 1427.3842 1437.2511 1452.4555 1463.0117 1468.4202 1477.6577 1483.4342 1487.8401 1572.5250 1592.0341 1609.8236 1667.9131 1680.8871 2968.1120 2986.7264 2991.1197 2996.0653 3017.9605 3033.4108 3044.1953 3052.2039 3064.4812 3117.2763 3144.3674 3147.0274 3160.1376 3177.5188 3511.8142 3607.4720
redmass: 7.6892 10.9942 8.3017 6.8333 6.8853 5.1814 6.6198 2.2384 6.3804 2.9492 3.8488 4.5455 6.1189 5.9074 5.2684 3.5749 2.3866 10.3823 4.6615 4.1592 3.9646 9.4778 4.9714 5.6613 6.9348 6.4595 3.9926 8.4197 1.9025 3.6670 3.6144 5.0558 4.8173 7.0192 5.9978 9.6621 1.3201 6.6892 7.9250 2.8659 1.1901 1.2349 4.2062 8.2509 1.4180 1.6759 8.0417 1.5471 4.0601 7.4410 1.3858 5.6546 3.8960 8.9952 2.7052 1.9211 1.3810 1.4078 10.1134 3.6294 4.0162 2.2528 2.2876 2.7429 3.4471 2.4934 2.0058 5.5000 7.4689 1.4023 1.4230 2.5146 3.4047 1.3188 1.4151 1.8051 1.3413 2.4743 1.2406 1.1162 1.2746 1.2545 1.5923 2.1898 1.5387 1.5934 3.3043 2.0072 3.7857 1.0855 3.3700 1.1243 1.0790 1.1487 1.1041 4.9901 6.8279 7.3112 6.8455 8.2169 12.7976 1.0601 1.0617 1.0636 1.0600 1.0966 1.0981 1.0639 1.0963 1.1022 1.1090 1.0876 1.0922 1.0924 1.0989 1.0639 1.0846
irintensity: 0.1665 0.2538 1.9039 4.9131 2.4323 2.3537 0.1311 0.3566 0.2320 0.1915 1.9004 0.8779 0.1879 3.3729 1.1466 2.4467 1.4367 3.4852 1.6124 4.4098 3.5009 3.0652 3.0370 10.0815 11.9341 3.0107 8.9742 3.6711 27.9648 0.0263 5.7708 2.7032 22.8191 8.3301 2.6034 7.8198 127.7006 18.8961 0.0957 10.4096 136.7939 19.6102 0.4296 11.1675 5.3014 47.7235 65.4664 1.9816 1.4938 64.8194 4.0757 8.3603 42.3441 25.5742 3.2298 19.7134 6.8714 12.7438 4.8812 224.0902 61.8588 30.6495 13.8308 4.3516 60.4903 20.5597 18.3359 49.9991 1.4836 2.2997 12.1544 7.3999 19.8185 5.8218 16.5831 36.7418 5.4109 182.5487 22.5313 1.6130 26.8859 0.0597 47.6077 10.4331 2.6774 32.4025 66.3034 12.4320 65.1335 26.3685 15.7285 3.4046 1.3356 9.8852 12.0814 88.5509 95.1887 54.7375 74.5278 192.8616 361.9304 15.7081 3.6118 16.0888 29.1651 13.2294 1.4674 22.9005 47.9939 68.1970 23.7346 1.2571 1.5699 8.9293 12.8470 19.1223 158.5914
temp: 298.150 k
press: 1.00000 atm
elementType: 8 8 8 8 8 7 7 7 7 6 6 6 6 6 6 6 6 6 6 6 6 6 6 6 6 1 1 1 1 1 1 1 1 1 1 1 1 1 1 1 1
symmnumber: 1
zpe: 805934.3 jmol-1
zpe.correction: 0.306964 hartree
zpe.thermalcorrener: 0.329785 hartree
zpe.thermalcorrenthalpy: 0.330729 hartree
zpe.thermalcorrgfe: 0.248920 hartree
zpe.sumelectzpe: -1212.565532 hartree
zpe.sumelectthermal: -1212.542711 hartree
zpe.sumelectthermalent: -1212.541767 hartree
zpe.sumelectthermalfe: -1212.623576 hartree
dipole: 1.4389 0.0824 1.5004
dipole: 2.0805
quadrupole: -149.0245 -124.6656 -146.0539
quadrupole: 7.5784 -5.5601 3.4383
quadrupole: -9.1098 15.2490 -6.1392 7.5784 -5.5601 3.4383
hfenergy: -1212.8724959 hartree
pointgroup: C01 [X(C16H16N4O5)]
dipole: -0.3336078 -0.4390957 0.6049 debye
polarizability: 306.3064475|-26.3993484|282.5992059|-31.1838384|-1.8302869|115.5757986 unknown
InChI: InChI=1S/C16H16N4O5/c21-13(22)7-2-1-3-8-24-12-6-4-5-10-9-11(15-17-19-20-18-15)16(23)25-14(10)12/h4-6,9,19,21H,1-3,7-8H2
charge 0 multiplicity 1
41 atoms
O  2.843455 -1.566176 -0.933053
O  0.01418 -0.764559 -0.490276
O  3.655768 6.612322 -0.02918
O  4.937785 4.996687 -1.094004
O  -1.537633 0.913727 -0.338736
N  -4.299975 0.185724 0.208358
N  -4.679017 -2.073275 0.489943
N  -5.607851 -0.119798 0.469979
N  -5.876464 -1.472955 0.646067
C  2.360008 1.892043 0.763188
C  2.717187 0.389986 0.642989
C  3.37772 2.838684 0.086331
C  2.741173 -0.079722 -0.820925
C  3.015474 4.317242 0.321191
C  1.797536 -2.424386 -0.613995
C  0.422403 -2.101723 -0.411503
C  -0.540858 -3.119556 -0.13181
C  2.162713 -3.792296 -0.536318
C  -1.906955 -2.712735 0.065213
C  -0.135048 -4.482782 -0.0632
C  -2.319698 -1.387781 0.004959
C  1.215043 -4.807988 -0.268864
C  3.975517 5.280681 -0.347625
C  -1.353068 -0.31289 -0.269379
C  -3.730305 -1.064897 0.22542
H  1.349874 2.05493 0.334835
H  2.288089 2.148706 1.839602
H  1.955997 -0.19345 1.193378
H  3.696927 0.184561 1.116282
H  3.423922 2.651137 -1.002677
H  4.395115 2.641419 0.476786
H  3.653253 0.252582 -1.341753
H  1.85103 0.275158 -1.364475
H  1.997368 4.537498 -0.057479
H  2.986743 4.557335 1.401886
H  3.218014 -4.033118 -0.696949
H  -2.662744 -3.477836 0.275837
H  -0.880863 -5.256015 0.147689
H  1.546957 -5.849558 -0.220999
H  4.296323 7.219686 -0.490315
H  -6.333492 0.593787 0.531083
