program: Gaussian 09
title: 000208853
version: EM64L-G09RevD.01
frameworkgroup: C1[X(C16H18N2O2)]
method: RPBEPBE
basis: SDD
operation: Freq
keyword: #p
keyword: freq=noraman
keyword: PBEPBE/SDD
title: #p freq=noraman PBEPBE/SDD
converged: YES YES NO NO
title: Mulliken charges:
elementType: O O N N C C C C C C C C C C C C C C C C H H H H H H H H H H H H H H H H H H
charge: -0.299710 -0.262160 -0.072500 -0.570738 -0.026824 -0.405175 -0.346913 -0.525077 0.234549 0.249206 0.451299 -0.371998 -0.380534 -0.448260 -0.382507 -0.228876 -0.226400 -0.219708 -0.225357 -0.241028 0.246062 0.196931 0.235172 0.282040 0.204816 0.194295 0.236006 0.315294 0.256360 0.244711 0.246933 0.233983 0.267149 0.225672 0.226004 0.227606 0.228927 0.230751
chargesum: 0.00000
title: Mulliken charges with hydrogens summed into heavy atoms:
elementType: O O N N C C C C C C C C C C C C C C C C
charge: -0.299710 -0.262160 -0.072500 0.000916 0.219238 0.026928 0.139944 -0.094775 0.234549 0.249206 0.451299 -0.127287 -0.133601 -0.214276 -0.115359 -0.003204 -0.000397 0.007898 0.003570 -0.010277
polarizability: 2.76516053e+02 8.04233296e+00 1.60984797e+02 -1.97765067e+01 7.76933485e+00 1.32675939e+02
1716.lowfreq: -5.9983 -4.1687 -0.0005 -0.0003 0.0003 7.0566 18.4129 19.4137 27.5258
frequency: 17.7323 19.1164 27.4899 56.0443 76.9672 97.8933 139.6829 158.8228 187.5668 224.0129 232.9796 259.3051 291.6588 325.7558 346.5971 377.9670 394.7039 404.8913 419.2132 448.6928 450.9593 472.3307 489.0478 532.3802 552.8784 572.0108 616.2624 622.7964 653.5025 704.6992 712.5726 720.7625 738.9055 751.9060 758.8837 807.0240 812.0495 845.1734 859.6169 861.1985 872.6068 897.4573 918.6283 928.5682 962.5491 969.2025 982.3421 986.6210 990.3590 1001.0598 1019.8639 1025.7365 1031.2016 1053.0631 1081.9722 1087.0934 1111.2145 1141.8576 1145.2769 1160.0871 1166.5491 1171.5766 1181.4698 1197.1845 1210.2508 1221.1116 1237.6882 1241.0264 1263.3058 1277.9601 1294.8664 1312.8439 1317.5185 1342.2865 1360.8515 1378.0332 1389.3853 1392.8340 1440.3632 1442.1836 1449.9312 1462.2992 1464.8258 1475.1809 1482.9920 1589.9697 1594.4880 1611.5612 1614.7573 1647.8935 2858.2793 2902.2693 2986.7519 3004.8474 3014.2446 3052.5043 3114.1985 3124.7498 3134.5969 3136.8140 3138.0489 3147.4552 3148.3505 3161.0431 3163.3998 3173.2918 3280.5185 3501.5222
redmass: 4.3969 4.8581 4.5235 5.3967 3.9129 4.3778 3.2793 3.5812 6.1147 4.6873 3.6586 4.0917 4.9180 1.6199 1.7519 3.3541 1.8366 2.8373 3.8797 3.1349 3.2827 3.3925 5.4632 5.0136 4.0875 6.3586 6.2482 3.7984 3.5446 2.2330 4.3269 5.3072 1.8909 1.2384 1.8485 4.5723 3.6967 1.4110 1.3687 2.3762 2.7670 2.6254 1.3771 1.3685 1.2892 5.1400 1.4491 2.0723 4.6241 1.3713 2.4051 2.1059 2.2123 2.2615 1.5942 2.4308 2.9592 1.8527 1.9087 1.0779 2.4242 1.0588 1.1105 1.2123 2.0248 1.5204 2.1598 1.6923 1.4265 1.3776 1.2646 1.3732 1.2818 1.4323 1.5780 2.5861 5.5280 2.4035 2.0661 2.3986 1.1176 1.1686 1.1046 2.5486 2.2857 7.5314 6.1003 7.0710 6.1294 1.0842 1.0699 1.0696 1.0701 1.0877 1.0830 1.0901 1.0874 1.0861 1.0850 1.0912 1.0967 1.0960 1.0897 1.0946 1.1015 1.1006 1.0520 1.0870
irintensity: 0.0648 0.0642 0.2244 1.6487 1.1807 0.2940 3.6162 1.2016 0.0703 1.5369 6.6354 5.9090 0.9726 20.7270 12.0984 5.9856 3.1544 0.3903 11.2496 7.1622 9.0560 8.1079 0.3053 1.1866 1.8959 1.7569 0.1379 8.0439 7.6717 27.6368 0.4857 11.4586 168.8549 105.4637 53.1492 15.6745 14.2751 0.0839 6.1430 16.6173 53.3557 65.2701 4.1297 5.6462 0.0549 96.3141 1.2973 4.6927 0.5333 1.4834 19.2779 3.0375 19.0923 20.1008 8.3955 25.4104 27.9286 12.3771 1.6437 7.4661 7.8233 0.3645 2.2252 3.7870 5.6278 30.3538 226.6441 75.8988 0.6703 4.9753 5.6715 5.3780 25.1222 5.4027 24.2600 0.3867 16.1538 12.6199 14.0911 4.0534 5.9880 21.1793 16.1917 192.0657 11.1773 31.7892 0.6712 4.6258 4.5277 17.9171 67.7648 73.0888 29.8619 15.6603 40.8387 19.8163 8.7190 0.0043 1.2952 12.6952 2.7523 34.1248 13.9507 17.4183 25.3404 17.6867 21.2791 2.6734
temp: 298.150 k
press: 1.00000 atm
elementType: 8 8 7 7 6 6 6 6 6 6 6 6 6 6 6 6 6 6 6 6 1 1 1 1 1 1 1 1 1 1 1 1 1 1 1 1 1 1
symmnumber: 1
zpe: 811575.9 jmol-1
zpe.correction: 0.309113 hartree
zpe.thermalcorrener: 0.326739 hartree
zpe.thermalcorrenthalpy: 0.327683 hartree
zpe.thermalcorrgfe: 0.260953 hartree
zpe.sumelectzpe: -878.930586 hartree
zpe.sumelectthermal: -878.912960 hartree
zpe.sumelectthermalent: -878.912016 hartree
zpe.sumelectthermalfe: -878.978745 hartree
dipole: 3.9202 -0.8440 -1.1713
dipole: 4.1776
quadrupole: -108.4638 -116.8318 -115.1901
quadrupole: 2.6563 -5.6315 3.3476
quadrupole: 5.0314 -3.3366 -1.6948 2.6563 -5.6315 3.3476
hfenergy: -879.2396986 hartree
pointgroup: C01 [X(C16H18N2O2)]
dipole: -1.5252162 0.5850892 0.1811417 debye
polarizability: 271.168362|-28.9772942|137.1274334|18.6434132|6.93724|161.8809938 unknown
InChI: InChI=1S/C16H18N2O2/c17-18(10-13-6-2-1-3-7-13)11-14-12-19-15-8-4-5-9-16(15)20-14/h1-9,14H,10-12,17H2
charge 0 multiplicity 1
38 atoms
O  2.094431 -0.063814 1.296572
O  2.886358 0.346727 -1.483491
N  -1.375349 0.595912 0.135951
N  -1.384025 1.509787 -0.987536
C  1.091104 0.139178 0.208443
C  -0.127611 0.744822 0.920497
C  1.708932 1.017782 -0.885106
C  -2.608821 0.682665 0.973253
C  3.401121 -0.347811 0.838129
C  3.783246 -0.163922 -0.520267
C  -3.85661 0.276099 0.197833
C  4.337073 -0.835023 1.773418
C  5.088807 -0.497349 -0.935027
C  -5.064777 1.000854 0.339753
C  -3.832831 -0.858198 -0.654155
C  5.647644 -1.156206 1.357755
C  6.020663 -0.996948 0.000481
C  -6.234171 0.595587 -0.345214
C  -4.99695 -1.261304 -1.344194
C  -6.20344 -0.537178 -1.189985
H  0.823867 -0.850774 -0.210037
H  0.083921 1.807799 1.186757
H  -0.248422 0.186145 1.866375
H  0.990711 1.182957 -1.698826
H  2.023075 1.991121 -0.456798
H  -2.750953 1.711011 1.393029
H  -2.468017 -0.002277 1.832206
H  -1.945148 1.111306 -1.750651
H  -1.724233 2.458253 -0.732542
H  4.018055 -0.963006 2.812848
H  5.353996 -0.349845 -1.986815
H  -5.093364 1.88421 0.990419
H  -2.892808 -1.410064 -0.769371
H  6.369971 -1.53513 2.088328
H  7.033459 -1.253293 -0.32752
H  -7.162903 1.164426 -0.22343
H  -4.966093 -2.139777 -1.998834
H  -7.107311 -0.85112 -1.723945
