program: Gaussian 09
title: 000208851
version: EM64L-G09RevD.01
frameworkgroup: C1[X(C16H14N2O2)]
method: RPBEPBE
basis: SDD
operation: Freq
keyword: #p
keyword: freq=noraman
keyword: PBEPBE/SDD
title: #p freq=noraman PBEPBE/SDD
converged: YES YES NO NO
title: Mulliken charges:
elementType: O O N N C C C C C C C C C C C C C C C C H H H H H H H H H H H H H H
charge: -0.214517 -0.245261 -0.200740 -0.616224 -0.525034 0.303717 0.284685 0.107747 0.563722 -0.545422 -0.400705 -0.342754 -0.455863 -0.381933 -0.246903 -0.222893 0.264867 -0.226874 -0.236275 -0.248087 0.266910 0.242009 0.293787 0.246562 0.237263 0.226327 0.281495 0.227107 0.224106 0.223755 0.226757 0.226093 0.342081 0.320497
chargesum: 0.00000
title: Mulliken charges with hydrogens summed into heavy atoms:
elementType: O O N N C C C C C C C C C C C C C C C C
charge: -0.214517 -0.245261 -0.200740 0.046354 -0.258123 0.303717 0.284685 0.107747 0.563722 -0.009626 -0.154143 -0.105491 -0.229536 -0.100438 -0.019795 0.001213 0.264867 -0.003119 -0.009518 -0.021995
polarizability: 2.33674541e+02 2.96712764e+00 1.76779579e+02 -5.86474638e+00 -6.91515812e+00 1.42176494e+02
1716.lowfreq: -8.2244 -5.4343 -0.0004 0.0001 0.0006 6.7306 28.2707 34.1009 42.8134
frequency: 28.1565 34.0285 42.7974 55.1790 68.1068 69.6791 124.3813 161.3459 213.0533 234.2302 252.1829 279.3546 294.1589 346.0924 391.2934 404.6389 433.3087 458.7595 474.8857 491.8771 502.2930 526.8654 537.9023 565.4381 604.2228 619.2195 624.5886 641.2835 670.5336 704.6524 708.7303 732.0727 757.3947 769.2968 789.1580 817.9443 834.3966 857.8387 861.7836 872.0377 896.0955 932.5451 939.2892 976.1366 981.3787 989.4805 1002.5437 1010.5493 1027.0023 1031.7548 1057.0948 1082.4587 1090.0883 1092.9434 1162.6811 1168.8093 1171.8771 1185.8170 1194.7122 1195.8060 1210.9658 1246.2081 1272.2452 1285.9025 1328.6728 1338.7203 1350.7411 1354.1659 1382.4986 1409.8436 1439.2838 1443.0815 1455.7833 1484.9110 1486.0242 1594.1406 1600.6364 1604.3489 1611.8154 1624.0044 1653.4870 1663.9160 2984.5964 3014.5907 3045.3140 3114.8112 3116.7678 3128.5907 3130.2247 3137.6807 3143.8952 3149.6387 3161.2593 3166.2321 3515.3109 3667.9378
redmass: 4.2167 4.6493 5.5562 5.1780 7.0688 5.6569 7.5755 4.8412 4.4448 3.2649 5.1248 4.1232 5.1771 5.6970 3.8338 2.8374 3.4220 1.6486 4.4379 4.6163 4.0815 1.6059 2.7020 4.1207 5.4370 4.1694 3.3679 2.0554 6.0816 3.5790 2.2812 2.1052 1.5640 2.5583 4.4344 3.4114 2.4021 1.3067 2.1103 2.4460 3.4943 1.4529 1.5119 1.3202 1.3669 5.8604 1.3468 2.8919 2.2843 2.2653 2.0306 1.9609 2.4643 2.8244 1.7708 1.1376 1.0585 1.4480 1.5303 1.1391 1.6339 2.8790 1.5718 1.6708 1.7987 1.2644 5.3946 2.2609 8.0297 4.0906 1.1435 2.1761 2.4693 2.5246 3.2130 5.9994 1.4042 6.3520 5.9630 7.4519 5.4900 6.9910 1.0582 1.0828 1.1022 1.0867 1.0899 1.0852 1.0908 1.0899 1.0956 1.0949 1.1014 1.1003 1.0448 1.1044
irintensity: 3.7805 0.6863 4.1749 0.6784 6.7206 2.1668 2.0549 1.9593 2.9800 0.4317 2.5536 5.4542 6.7800 0.8846 3.1685 0.0709 6.3314 3.2818 17.2130 1.3966 9.0890 149.0475 51.2412 3.4198 2.8785 7.9668 22.5373 86.9154 2.5859 13.0153 37.3945 24.5658 81.5543 31.6205 3.8041 4.5949 0.3325 0.5436 1.5156 0.2844 26.5092 5.0795 1.6931 0.1200 0.0878 0.9936 0.2018 22.0777 5.2909 3.2857 0.3959 7.3090 5.4933 29.8440 45.7693 11.6244 0.1341 19.3725 2.7020 0.4833 31.0620 27.3526 34.3250 75.8877 83.8368 1.9548 15.0549 104.0230 0.3382 3.5171 32.7803 9.2125 41.1680 51.9877 75.9556 1.6770 56.0100 38.8319 10.5425 96.1608 306.6207 251.1161 46.8814 6.5117 5.6275 6.8917 2.4660 1.8519 8.8594 7.5741 28.8662 28.3824 35.3307 23.1603 44.2724 28.4596
temp: 298.150 k
press: 1.00000 atm
elementType: 8 8 7 7 6 6 6 6 6 6 6 6 6 6 6 6 6 6 6 6 1 1 1 1 1 1 1 1 1 1 1 1 1 1
symmnumber: 1
zpe: 696002.1 jmol-1
zpe.correction: 0.265093 hartree
zpe.thermalcorrener: 0.281870 hartree
zpe.thermalcorrenthalpy: 0.282814 hartree
zpe.thermalcorrgfe: 0.218693 hartree
zpe.sumelectzpe: -876.693373 hartree
zpe.sumelectthermal: -876.676597 hartree
zpe.sumelectthermalent: -876.675653 hartree
zpe.sumelectthermalfe: -876.739773 hartree
dipole: 4.7323 1.3599 -0.3797
dipole: 4.9385
quadrupole: -78.4239 -113.9919 -119.7271
quadrupole: -13.1025 -0.4525 5.8593
quadrupole: 25.6237 -9.9443 -15.6794 -13.1025 -0.4525 5.8593
hfenergy: -876.9584664 hartree
pointgroup: C01 [X(C16H14N2O2)]
dipole: -1.8748419 -0.4829667 -0.1635081 debye
polarizability: 233.7514693|1.3325235|176.4287988|6.3649853|7.3298796|142.4503462 unknown
InChI: InChI=1S/C16H14N2O2/c17-14(19)10-18-13-9-5-4-8-12(13)15(16(18)20)11-6-2-1-3-7-11/h1-9,15H,10,17H2
charge 0 multiplicity 1
34 atoms
O  -0.112677 1.739814 2.121175
O  -1.818528 1.777683 -1.398167
N  -1.503543 0.249477 0.931117
N  -3.990409 2.365597 -0.816518
C  0.768867 -0.442846 1.187579
C  -0.060043 -1.497955 0.46023
C  -1.389896 -1.023724 0.310737
C  -0.276181 0.663087 1.495139
C  1.949459 0.092766 0.371198
C  -2.643577 1.13889 0.847368
C  0.299642 -2.747808 -0.061734
C  -2.38017 -1.773592 -0.347654
C  3.278208 -0.13938 0.798501
C  1.719315 0.807068 -0.833792
C  -0.686735 -3.526922 -0.723523
C  -2.007675 -3.040679 -0.863487
C  -2.764608 1.775165 -0.564418
C  4.370483 0.327134 0.030943
C  2.810356 1.274778 -1.59623
C  4.13877 1.034431 -1.169989
H  1.152902 -0.826717 2.151936
H  -3.578733 0.616588 1.125159
H  -2.465715 1.952085 1.578262
H  1.328868 -3.112463 0.027605
H  -3.400879 -1.398726 -0.476728
H  3.460281 -0.679006 1.736485
H  0.692736 1.006558 -1.167638
H  -0.421707 -4.506185 -1.135897
H  -2.756173 -3.64784 -1.38484
H  5.39568 0.143957 0.372287
H  2.624903 1.83065 -2.522281
H  4.983121 1.400482 -1.765117
H  -4.121363 2.856133 -1.701214
H  -4.74648 2.368202 -0.133394
