program: Gaussian 09
title: 000208847
version: EM64L-G09RevD.01
frameworkgroup: C1[X(C13H21NO2S)]
method: RPBEPBE
basis: SDD
operation: Freq
keyword: #p
keyword: freq=noraman
keyword: PBEPBE/SDD
title: #p freq=noraman PBEPBE/SDD
converged: YES YES NO NO
title: Mulliken charges:
elementType: S O O N C C C C C C C C C C C C C H H H H H H H H H H H H H H H H H H H H H
charge: 0.940179 -0.536028 -0.538969 -0.340379 -0.394968 -0.332701 -0.334695 -0.345224 -0.030681 -0.682099 -0.684152 -0.229340 -0.270828 0.449472 -0.365073 -0.368604 -0.799936 0.226019 0.262937 0.225558 0.221311 0.201059 0.193548 0.247393 0.207489 0.227808 0.208372 0.247519 0.208343 0.225708 0.204314 0.274954 0.293690 0.242163 0.243007 0.240815 0.230934 0.231084
chargesum: 0.00000
title: Mulliken charges with hydrogens summed into heavy atoms:
elementType: S O O N C C C C C C C C C C C C C
charge: 0.940179 -0.536028 -0.538969 -0.340379 0.093989 0.114169 0.059912 0.109657 -0.030681 0.001601 -0.045787 0.045614 0.022862 0.449472 -0.122910 -0.125597 -0.097103
polarizability: 2.33733485e+02 -1.24996104e+01 1.60270290e+02 3.14804432e+00 1.44681335e+01 1.49250949e+02
1716.lowfreq: -11.6533 -7.3834 -1.4446 -0.0015 -0.0013 0.0017 19.3936 25.4994 33.2047
frequency: 19.0237 25.0509 33.1265 44.4665 57.6170 71.7724 85.8346 111.4372 121.9187 142.0913 155.6672 182.9364 202.6152 221.7627 225.0236 231.8894 251.7520 265.7320 294.3018 300.0571 319.6677 370.6046 379.8956 396.4204 406.7536 441.0111 480.6663 508.6357 579.8465 613.9849 623.0590 709.1339 733.0355 758.6465 773.7762 795.2789 815.1715 822.0306 843.3784 851.7096 869.7355 881.6611 919.5039 927.9891 957.5767 985.4327 990.0785 996.0465 1028.9401 1048.1992 1049.2321 1054.4207 1081.9595 1093.1091 1099.9267 1116.3930 1160.1052 1182.3780 1186.9376 1217.9364 1255.1846 1259.4407 1275.9942 1289.0361 1294.9547 1318.0262 1342.2144 1353.3005 1363.9103 1381.5626 1390.3496 1390.7957 1399.1030 1400.1243 1438.8835 1443.3990 1468.6422 1470.8710 1472.3166 1473.8023 1475.3816 1476.7705 1478.9497 1487.0874 1496.8724 1595.5807 1596.4935 2956.3593 2962.6081 2970.9516 2978.2509 2980.1959 2982.5972 3008.1230 3010.2374 3019.6463 3040.5316 3049.8925 3062.7791 3078.1459 3078.3958 3081.4750 3083.3893 3092.7176 3134.3853 3136.1509 3160.7376 3165.6112
redmass: 3.1734 1.1161 3.5125 3.5480 2.8321 2.7409 2.4129 3.0921 3.7809 3.0191 2.1129 1.6461 6.2761 1.2721 5.9769 2.5778 3.4414 4.0537 4.3906 3.0940 3.7684 2.4172 2.9196 8.2855 2.8847 3.8923 3.5281 2.9229 4.9903 4.2561 6.8656 3.2775 1.2725 1.4142 5.3178 10.0859 1.9728 1.3935 1.7723 1.2539 1.4258 1.6439 14.2870 1.7998 1.3269 1.3628 1.4325 4.8139 2.3393 2.4119 1.6034 2.4684 1.8607 1.9943 2.0253 1.2816 2.1621 1.1558 2.7600 2.9599 1.2978 1.2888 1.1966 1.2191 1.2670 1.1989 1.3657 1.2837 1.2031 6.1725 1.2140 2.9579 1.2203 1.2024 1.0792 1.0771 1.0686 1.1084 1.0552 2.2666 1.0744 1.0410 1.0417 1.0639 1.0773 6.7496 6.2537 1.0588 1.0622 1.0364 1.0557 1.0391 1.0423 1.0814 1.0811 1.0982 1.0984 1.1000 1.0945 1.0992 1.0991 1.1014 1.1022 1.1001 1.0892 1.0893 1.0952 1.0964
irintensity: 1.1265 0.4989 0.1383 0.7405 0.4896 0.8670 0.2656 0.9287 0.6885 1.5089 0.0918 0.5049 2.2169 0.3111 17.4672 1.7153 2.9192 4.9814 1.7808 9.9525 2.2634 3.9607 0.4124 28.4312 0.5896 64.3441 15.8847 47.5198 2.1486 131.3631 3.8037 3.2401 19.2608 6.6185 26.7986 71.2982 7.9728 30.1595 7.9841 8.1329 3.9955 17.0185 69.0168 59.2559 0.5227 1.2678 1.2638 3.0610 5.5639 5.2772 19.6119 22.6940 4.0773 11.4838 0.2301 9.3820 10.5591 8.7803 25.3897 5.3738 7.6468 8.6751 6.7390 8.6542 2.5250 4.2512 9.0830 5.7397 3.9759 0.2164 12.9584 10.7723 15.5446 18.7079 21.6842 5.4537 3.0464 17.8366 13.9391 27.7730 12.9328 8.5886 14.4417 4.1528 30.7219 2.0250 7.0158 15.6194 18.4573 41.3561 70.5179 27.8354 20.4316 6.8295 34.3754 18.2161 14.6536 9.7474 20.3039 8.5832 61.7444 59.3527 38.5394 14.8406 14.5333 8.3215 4.9770 6.3315
temp: 298.150 k
press: 1.00000 atm
elementType: 16 8 8 7 6 6 6 6 6 6 6 6 6 6 6 6 6 1 1 1 1 1 1 1 1 1 1 1 1 1 1 1 1 1 1 1 1 1
symmnumber: 1
zpe: 826838.3 jmol-1
zpe.correction: 0.314926 hartree
zpe.thermalcorrener: 0.335338 hartree
zpe.thermalcorrenthalpy: 0.336282 hartree
zpe.thermalcorrgfe: 0.263591 hartree
zpe.sumelectzpe: -1109.737546 hartree
zpe.sumelectthermal: -1109.717134 hartree
zpe.sumelectthermalent: -1109.716190 hartree
zpe.sumelectthermalfe: -1109.788881 hartree
dipole: -2.8820 3.4177 -3.9433
dipole: 5.9612
quadrupole: -90.2873 -116.8943 -114.7252
quadrupole: 0.1648 -3.8643 6.4233
quadrupole: 17.0150 -9.5920 -7.4230 0.1648 -3.8643 6.4233
hfenergy: -1110.0524722 hartree
pointgroup: C01 [X(C13H21N1O2S1)]
dipole: 0.9938657 -1.017366 -1.8648851 debye
polarizability: 227.4970181|-22.4313588|174.1016446|-6.6226737|-7.6792352|141.6560612 unknown
InChI: InChI=1S/C13H21NO2S/c1-4-10-14(11-5-2)17(15,16)13-8-6-12(3)7-9-13/h6-9H,4-5,10-11H2,1-3H3
charge 0 multiplicity 1
38 atoms
S  -0.50139 0.92993 0.743678
O  -1.094616 -0.109277 1.865081
O  -0.406685 2.523727 1.075874
N  -1.33559 0.836998 -0.909109
C  -2.262761 1.955196 -1.204736
C  -1.553179 -0.536632 -1.418643
C  -3.752214 1.830414 -0.794512
C  -2.616321 -1.445582 -0.742243
C  1.216849 0.288755 0.299476
C  -3.977085 1.713675 0.727898
C  -2.627444 -2.842689 -1.400049
C  2.053744 1.103484 -0.479918
C  1.616027 -0.950626 0.821787
C  3.803645 -0.624913 -0.272467
C  3.353589 0.631342 -0.762625
C  2.922428 -1.400876 0.525362
C  5.195246 -1.130608 -0.606347
H  -2.190935 2.107498 -2.30188
H  -1.825797 2.851086 -0.722799
H  -0.575597 -1.061002 -1.391683
H  -1.802938 -0.407348 -2.492499
H  -4.255998 2.744067 -1.17226
H  -4.225347 0.979895 -1.322691
H  -2.384155 -1.530076 0.334767
H  -3.618757 -0.988104 -0.821864
H  -3.533539 2.57621 1.258287
H  -5.056146 1.682199 0.965124
H  -3.511035 0.802238 1.143634
H  -1.642137 -3.337889 -1.304322
H  -3.378235 -3.497382 -0.922668
H  -2.870643 -2.781961 -2.478402
H  1.706539 2.076691 -0.840352
H  0.931296 -1.52289 1.456357
H  4.029376 1.248514 -1.365867
H  3.261514 -2.363509 0.925103
H  5.187112 -1.712424 -1.548454
H  5.907603 -0.298398 -0.741556
H  5.587078 -1.793035 0.18472
