program: Gaussian 09
title: 000208846
version: EM64L-G09RevD.01
frameworkgroup: C1[X(C22H29NOS)]
method: RPBEPBE
basis: SDD
operation: Freq
keyword: #p
keyword: freq=noraman
keyword: PBEPBE/SDD
title: #p freq=noraman PBEPBE/SDD
converged: YES YES NO NO
title: Mulliken charges:
elementType: S O N C C C C C C C C C C C C C C C C C C C C C C H H H H H H H H H H H H H H H H H H H H H H H H H H H H H
charge: 0.061048 -0.166687 -0.106872 -0.340239 -0.331059 -0.422675 -0.358023 -0.353461 -0.298735 -0.405763 -0.691306 -0.683303 -0.235100 0.493026 0.431218 -0.351843 -0.421526 -0.437032 -0.359138 -0.232120 -0.227047 -0.227429 -0.239063 -0.242679 -0.244633 0.183924 0.200704 0.179934 0.202262 0.222833 0.230984 0.209356 0.208525 0.195400 0.208339 0.262347 0.224411 0.247481 0.206677 0.208431 0.222242 0.208689 0.209498 0.220620 0.247793 0.239203 0.224397 0.262888 0.223783 0.228220 0.223821 0.230139 0.226926 0.230617
chargesum: 0.00000
title: Mulliken charges with hydrogens summed into heavy atoms:
elementType: S O N C C C C C C C C C C C C C C C C C C C C C C
charge: 0.061048 -0.166687 -0.106872 0.044390 0.051138 0.031141 0.059858 0.050278 0.188023 -0.158282 -0.053957 -0.044495 -0.235100 0.493026 0.431218 -0.104050 -0.182323 -0.212635 -0.096250 -0.008338 0.001173 -0.003608 -0.008924 -0.015753 -0.014016
polarizability: 2.97457996e+02 -1.89777971e+01 2.70162285e+02 1.19763905e+01 8.03032316e+00 2.17419655e+02
1716.lowfreq: -5.0017 -0.5844 -0.0018 -0.0017 -0.0011 4.7149 13.2382 17.1881 20.1242
frequency: 12.3975 16.2355 19.9941 28.3980 28.4918 33.0610 56.9820 59.8402 63.0717 66.7525 78.9719 85.9537 102.2740 118.9817 161.0733 169.5227 186.7361 206.6710 217.8541 221.7100 223.6794 233.0162 239.4968 274.5502 281.3068 313.2492 342.2463 357.7070 401.2842 402.9705 406.8021 454.4800 467.7041 488.2834 504.3822 524.4434 560.4784 610.1409 615.6437 625.7438 654.9666 700.4608 703.7195 733.5326 746.5444 749.8290 757.3319 788.0854 791.7354 816.2694 835.5695 847.0475 857.1950 859.1725 868.6376 878.0791 879.4319 899.8004 917.3994 918.6119 931.9304 972.1844 981.7112 989.8797 990.9370 993.3000 998.7783 1026.5507 1027.9263 1029.9858 1044.5579 1055.3441 1067.8698 1079.7158 1084.6531 1090.8527 1096.7160 1112.5624 1114.3732 1129.3796 1153.2586 1164.0817 1171.7103 1172.7833 1181.7369 1190.0132 1192.1066 1199.4572 1205.3848 1227.6055 1247.5812 1255.2231 1262.3259 1282.1728 1288.5903 1292.0194 1297.7443 1311.5116 1320.2452 1325.1292 1329.6902 1337.7027 1359.3288 1371.0654 1379.3342 1384.6232 1387.9371 1391.1622 1393.1170 1438.0244 1441.0352 1458.8025 1465.5682 1467.3014 1474.4360 1475.5279 1478.3473 1478.5484 1479.1455 1480.0541 1482.9155 1487.0968 1488.4383 1590.6096 1595.4907 1608.3994 1614.0061 2844.0674 2856.0462 2967.1366 2967.3662 2973.4381 2974.3444 2978.0928 2986.6067 3001.7404 3011.8652 3020.8819 3029.5538 3040.1773 3041.8141 3070.1451 3071.9247 3076.3886 3077.1750 3090.4568 3110.9677 3118.0461 3124.4434 3125.9846 3135.5443 3138.8839 3146.7145 3152.0233 3163.6111 3164.8641
redmass: 4.2772 3.9307 4.0405 3.8155 4.4554 4.1519 3.2376 3.1678 3.4486 3.4740 1.9990 2.2836 4.0596 6.2803 2.5908 2.7109 3.7997 2.1224 1.2569 3.6029 1.3316 4.0476 3.7716 4.8279 4.6795 3.0917 2.5696 4.1181 2.8150 2.8170 4.5809 4.2750 3.9589 3.6634 5.1779 3.3247 4.3035 6.0550 6.4203 6.0357 5.9785 1.7684 1.8609 2.5866 1.1028 1.0927 1.9140 1.9450 1.4906 3.2748 3.6979 1.2589 1.6533 2.5332 1.3443 2.3563 1.6171 1.5545 2.0380 1.4596 1.5184 1.3918 1.3976 5.8051 4.0802 1.4887 1.3246 2.3351 2.1902 2.4057 2.9313 2.2409 2.9956 1.6741 1.6180 2.2047 1.9662 2.8557 2.2066 2.2390 1.4232 3.9006 1.0568 1.0687 3.8831 1.1350 1.1161 2.1635 2.1582 1.5559 1.6684 1.3482 1.3703 1.1224 1.4058 1.1313 1.2818 1.3157 1.4471 1.3372 1.2874 1.2764 1.3709 1.3833 7.6479 1.4463 4.7540 1.2284 1.2513 2.2060 2.0891 1.0881 1.0813 1.0721 1.0646 1.0646 1.0437 1.0493 1.3307 1.5632 2.2752 1.0813 1.0854 6.0735 6.0786 5.9902 6.1013 1.0710 1.0703 1.0807 1.0596 1.0357 1.0359 1.0611 1.0612 1.0579 1.0885 1.0899 1.1014 1.0989 1.0986 1.1011 1.1013 1.0991 1.0991 1.1090 1.0877 1.0868 1.0870 1.0862 1.0915 1.0918 1.0959 1.0954 1.1015 1.1010
irintensity: 0.0034 0.1927 0.0296 0.0364 0.1631 0.1983 0.1173 0.4711 0.6745 0.0601 0.0866 0.0584 0.7396 1.3856 0.9998 2.3246 4.7765 1.0770 0.4702 1.4563 0.1766 0.5822 0.7860 0.5818 0.5789 0.7869 0.2610 4.7435 0.2258 0.1509 4.1177 25.3636 2.9929 7.5304 0.7478 0.8749 18.9655 6.6243 0.7944 14.4316 8.9689 42.4085 50.9029 42.4735 6.5227 4.3390 60.0905 2.4147 5.0705 13.3007 5.3077 0.2255 2.8950 7.0799 1.4861 17.4350 14.5471 2.6097 1.9949 3.1552 0.2123 0.3084 0.4835 1.4324 2.0316 0.3414 0.0833 3.7103 3.9226 25.2055 7.7174 8.4515 6.6568 13.4306 7.7246 174.6392 93.5730 197.3048 9.1254 99.2540 25.1655 38.9312 0.7105 1.8952 41.7067 4.0406 0.4685 17.5429 5.2433 12.5148 9.1999 6.9590 3.6183 1.5971 74.3418 5.9675 2.3539 5.2093 6.4997 4.3111 8.5437 21.3660 13.4960 1.0212 0.9405 4.1334 0.1077 19.4885 9.7800 17.0697 6.8087 3.0457 4.0707 0.4074 1.2753 1.0505 14.4387 12.0704 20.5914 12.0419 18.2484 16.7310 14.0113 1.6353 0.4181 9.4834 3.4813 54.7607 169.0192 11.3829 27.3731 52.7433 44.1010 32.9383 24.5416 24.0248 8.6260 12.6188 20.2827 15.3204 21.0938 68.4478 85.2237 46.3978 47.8951 20.6703 9.8904 4.5379 0.0671 0.2755 6.2706 24.4127 24.5475 34.9147 28.4346 19.4684
temp: 298.150 k
press: 1.00000 atm
elementType: 16 8 7 6 6 6 6 6 6 6 6 6 6 6 6 6 6 6 6 6 6 6 6 6 6 1 1 1 1 1 1 1 1 1 1 1 1 1 1 1 1 1 1 1 1 1 1 1 1 1 1 1 1 1
symmnumber: 1
zpe: 1195212.4 jmol-1
zpe.correction: 0.455232 hartree
zpe.thermalcorrener: 0.482012 hartree
zpe.thermalcorrenthalpy: 0.482956 hartree
zpe.thermalcorrgfe: 0.392340 hartree
zpe.sumelectzpe: -1381.859759 hartree
zpe.sumelectthermal: -1381.832979 hartree
zpe.sumelectthermalent: -1381.832035 hartree
zpe.sumelectthermalfe: -1381.922651 hartree
dipole: -3.3799 1.7964 -3.2762
dipole: 5.0382
quadrupole: -150.9568 -149.0382 -165.0769
quadrupole: 4.1275 -7.0887 9.3725
quadrupole: 4.0672 5.9857 -10.0529 4.1275 -7.0887 9.3725
hfenergy: -1382.314991 hartree
pointgroup: C01 [X(C22H29N1O1S1)]
dipole: -0.9175819 -1.6540277 -0.5927503 debye
polarizability: 286.0391275|33.6033811|232.3836528|18.4234287|-4.1174883|266.6171555 unknown
InChI: InChI=1S/C22H29NOS/c1-3-15-23(16-4-2)17-18-24-22(25)21(19-11-7-5-8-12-19)20-13-9-6-10-14-20/h5-14,21H,3-4,15-18H2,1-2H3
charge 0 multiplicity 1
54 atoms
S  1.411351 3.514743 1.252057
O  -0.59264 1.805347 1.245523
N  -3.554876 -0.4839 1.037376
C  -4.308879 -0.646719 -0.229121
C  -4.311416 -0.864517 2.256904
C  -2.795028 0.784054 1.134343
C  -3.401765 -0.824174 -1.466092
C  -4.430772 -2.392402 2.454383
C  -1.28853 0.484994 1.078524
C  1.503392 0.799472 0.337661
C  -4.217851 -1.041453 -2.75829
C  -5.231403 -2.750543 3.725545
C  0.748552 1.992705 0.956232
C  3.02066 0.870017 0.561064
C  1.116271 0.614131 -1.145573
C  3.891669 1.474665 -0.376707
C  1.165897 -0.68781 -1.707948
C  3.566609 0.316836 1.746024
C  0.741745 1.702258 -1.972377
C  5.280608 1.53227 -0.129595
C  0.8458 -0.899951 -3.066249
C  4.955246 0.374533 1.997186
C  0.418965 1.490685 -3.332791
C  5.818072 0.984577 1.058023
C  0.468519 0.190818 -3.884972
H  -5.000642 0.217438 -0.405767
H  -4.94564 -1.546123 -0.133879
H  -5.336806 -0.413742 2.263856
H  -3.779256 -0.445381 3.132379
H  -3.054173 1.475421 0.307392
H  -3.019065 1.321165 2.076261
H  -2.752698 0.065035 -1.593199
H  -2.729505 -1.685319 -1.286482
H  -4.918105 -2.850743 1.571706
H  -3.410762 -2.81876 2.506142
H  -1.019327 0.0243 0.113716
H  -0.991633 -0.178233 1.912372
H  1.156879 -0.109354 0.872858
H  -4.840798 -1.953484 -2.690252
H  -4.893329 -0.187041 -2.954278
H  -3.551923 -1.151348 -3.633104
H  -4.752424 -2.332455 4.631195
H  -6.261575 -2.349829 3.675982
H  -5.301981 -3.845263 3.857736
H  3.484833 1.899814 -1.299811
H  1.465595 -1.536084 -1.079931
H  2.900877 -0.152085 2.482247
H  0.70094 2.713811 -1.5522
H  5.94345 2.006353 -0.862274
H  0.89035 -1.911606 -3.485052
H  5.362209 -0.054445 2.919853
H  0.130172 2.342089 -3.959395
H  6.896224 1.030769 1.248644
H  0.218013 0.028469 -4.939249
