program: Gaussian 09
title: 000208843
version: EM64L-G09RevD.01
frameworkgroup: C1[X(C9H9I2NO3)]
method: RPBEPBE
basis: SDD
operation: Freq
keyword: #p
keyword: freq=noraman
keyword: PBEPBE/SDD
title: #p freq=noraman PBEPBE/SDD
converged: YES YES NO NO
title: Mulliken charges:
elementType: I I O O O N C C C C C C C C C H H H H H H H H H
charge: 0.116129 0.141572 -0.400418 -0.389259 -0.242176 -0.574824 -0.603763 -0.180951 0.535564 -0.339737 -0.354011 0.198514 -0.501176 -0.501138 0.548056 0.234548 0.220060 0.262939 0.273933 0.251068 0.280269 0.294020 0.381798 0.348986
chargesum: 0.00000
title: Mulliken charges with hydrogens summed into heavy atoms:
elementType: I I O O O N C C C C C C C C C
charge: 0.116129 0.141572 -0.018620 -0.040274 -0.242176 -0.000535 -0.149156 0.081988 0.535564 -0.065804 -0.102944 0.198514 -0.501176 -0.501138 0.548056
polarizability: 2.06891664e+02 -1.41253298e+01 2.04264335e+02 1.98297249e+01 1.84667750e+01 8.29897790e+01
1716.lowfreq: -6.5066 -2.3097 -0.0004 0.0003 0.0005 5.3934 12.3983 23.4203 34.6041
frequency: 12.3096 23.3612 34.5904 54.8815 74.7915 96.0162 123.5185 176.9086 184.4028 196.2107 224.9188 240.3678 256.8454 277.1536 296.5405 363.5577 365.8237 421.3242 445.9470 483.1329 505.6246 518.8742 542.1363 592.5209 601.7284 635.0602 685.3652 719.4088 727.8869 766.2068 774.4535 865.8936 883.8603 905.1615 948.4218 978.3389 1030.9089 1062.1138 1096.9501 1123.3898 1140.8932 1184.5537 1208.9904 1234.4925 1260.7686 1284.5992 1289.4130 1319.1491 1370.3906 1389.8860 1404.7544 1454.9641 1464.0374 1546.8504 1590.1914 1613.3822 1666.8958 2995.0930 3049.6942 3068.0822 3149.7261 3153.0251 3455.0614 3484.2984 3494.9979 3623.3008
redmass: 7.9377 8.1417 9.2242 5.7209 9.6638 21.3934 7.5796 4.4708 6.2964 4.7084 1.8459 5.5695 4.6904 3.4369 2.4634 3.1282 5.7405 1.0979 4.3335 5.2943 1.7050 4.0997 2.9815 2.9396 3.5011 1.4606 8.5551 5.8324 4.4160 2.9545 5.1202 1.9437 3.5749 1.4141 1.7225 5.0250 3.8698 2.6527 1.5514 1.7397 1.4516 1.4449 1.7913 2.0614 1.6011 1.3439 2.1667 1.2184 4.9587 2.9285 1.8971 4.0003 1.1067 6.5152 7.4444 1.3153 3.6888 1.0595 1.0927 1.0977 1.0922 1.0931 1.0649 1.0445 1.0637 1.0997
irintensity: 2.7499 2.8967 0.3869 1.1972 0.1222 0.2002 0.4415 0.6681 1.5111 10.6446 34.5001 10.8017 11.3392 16.2072 15.9057 1.7425 5.0809 127.1765 23.2421 0.5078 119.6389 19.2141 184.6258 32.7996 9.7372 188.5011 63.8162 30.9342 38.8702 4.1819 13.8542 6.1494 6.5719 2.6153 12.2558 68.7409 3.5753 216.2792 29.6361 39.6052 136.1627 9.8465 2.1265 97.0668 5.2930 6.3336 27.0693 2.6861 30.3315 22.6452 22.1994 108.7536 10.1877 52.1342 4.0730 142.1084 108.7250 31.8175 4.3286 17.7450 0.4312 4.3924 72.8175 13.8643 19.4701 9.3879
temp: 298.150 k
press: 1.00000 atm
elementType: 53 53 8 8 8 7 6 6 6 6 6 6 6 6 6 1 1 1 1 1 1 1 1 1
symmnumber: 1
zpe: 437919.3 jmol-1
zpe.correction: 0.166795 hartree
zpe.thermalcorrener: 0.183074 hartree
zpe.thermalcorrenthalpy: 0.184019 hartree
zpe.thermalcorrgfe: 0.117507 hartree
zpe.sumelectzpe: -650.677583 hartree
zpe.sumelectthermal: -650.661303 hartree
zpe.sumelectthermalent: -650.660359 hartree
zpe.sumelectthermalfe: -650.726871 hartree
dipole: 1.2267 -2.8590 -0.9077
dipole: 3.2408
quadrupole: -117.5743 -111.2014 -113.9607
quadrupole: -0.6683 4.4421 9.5749
quadrupole: -3.3288 3.0441 0.2848 -0.6683 4.4421 9.5749
hfenergy: -650.8443779 hartree
pointgroup: C01 [X(C9H9I2N1O3)]
dipole: -0.1548499 1.2643384 0.0559568 debye
dipolederiv: -0.2406849 -0.182977 0.1267837 -0.1953134 -0.3345909 0.1383274 0.1445866 0.1427533 -0.048507 -0.0030792 0.0915751 -0.0138599 0.1582072 -0.4412259 0.06404 -0.0201244 0.0669643 0.0210716 -0.5042678 0.0367281 0.245493 0.0388839 -0.1984577 -0.1678532 0.1489254 -0.0462583 -1.0433342 -1.1830752 0.1436501 0.2244668 0.2972877 -0.218974 -0.1340093 0.255073 -0.0906144 -0.4304054 -0.5181092 -0.1001968 0.2121247 -0.3108076 -0.6668825 0.1798044 0.0970151 -0.0187524 -0.6420665 -1.1346148 0.1940296 -0.2036186 0.2198847 -0.3123478 -0.0758366 -0.3004626 -0.0030666 -0.5514708 -0.210565 0.107696 -0.0091882 -0.0287613 0.0076339 -0.0078186 -0.2972016 0.1063072 0.0734173 0.8200449 -0.1932095 0.075247 -0.2295687 0.1043052 -0.0520272 0.2227191 -0.0660954 0.2222145 0.230231 -0.0645734 -0.0240609 -0.075719 -0.0061382 -0.0164199 -0.135877 0.019319 -0.085106 -0.1253612 -0.0445951 -0.0010066 0.2594345 -0.2827061 -0.0123822 -0.0258136 0.0670904 -0.079444 -0.2193053 0.0946273 -0.0006089 -0.2798041 -0.1876342 0.1218194 0.1261602 -0.0281801 -0.0976855 0.531176 0.0974961 -0.5176784 0.4556292 0.8208501 0.068644 -0.3289589 0.1023153 1.2636352 0.3360936 0.3410308 -0.2469619 0.7262605 0.5468581 -0.3939159 -0.3451011 -0.2804275 -0.001768 -0.0582377 -0.0558512 -0.023716 -0.4525146 1.0531306 -0.1470221 0.0496813 -0.2476765 -0.1333023 0.8039088 -0.2730033 -0.1812563 -0.3511924 -0.4543368 0.2531475 -0.1875915 0.2364038 0.1600781 -0.0206531 -0.0124173 0.069402 -0.0328175 0.0219394 0.1071349 0.0549476 0.0345417 -0.0128903 -0.0042758 -0.0039412 -0.0079295 0.055457 -0.1181388 -0.0962533 0.0106328 -0.0631661 0.0379142 0.0063758 -0.0345163 0.0516404 -0.0502011 0.0111625 0.0655163 0.0277453 0.0526004 -0.0226832 0.0559715 -0.0634267 0.0620574 -0.064806 0.0625347 0.0262724 0.0561921 0.0344553 0.115888 0.1007151 0.0592185 0.0141026 0.0593722 -0.0317609 0.0147803 0.0000454 0.0184608 0.1325278 0.272192 -0.082873 0.0618045 -0.0602678 0.086705 -0.0527746 0.1826704 -0.1633803 0.2514733 0.310304 0.030619 0.0460788 0.0282457 0.1469236 0.0942673 0.1700101 0.0726231 0.1861074 0.3752463 -0.0385837 0.0316283 -0.0643067 0.0818437 -0.0333881 0.0799192 0.0238503 0.3427616 0.3799703 -0.0465062 0.0090562 -0.1025824 0.3093069 0.0559473 0.0148071 0.0299328 0.3415741 unknown
polarizability: 189.5755117|-0.7266182|211.8644607|-34.5180656|-27.1944077|92.7058056 unknown
InChI: InChI=1S/C9H9I2NO3/c10-5-1-4(2-6(11)8(5)13)3-7(12)9(14)15/h1-2,7,13-14H,3,12H2
charge 0 multiplicity 1
24 atoms
I  3.50051 2.432504 -1.059069
I  2.126911 -3.310643 0.705456
O  -2.089426 -0.618747 -1.846551
O  3.750852 -0.834284 -0.472717
O  -3.204354 -1.400969 0.034346
N  -3.879779 1.413016 0.313434
C  -1.494067 0.980835 1.125475
C  -2.534848 0.969276 -0.063977
C  -0.097098 0.530621 0.73512
C  0.295116 -0.825655 0.876491
C  0.828991 1.447031 0.178427
C  -2.664626 -0.45948 -0.590501
C  2.103556 1.008765 -0.224511
C  1.571519 -1.256023 0.469865
C  2.508222 -0.348217 -0.092987
H  -1.904394 0.335093 1.924206
H  -1.473729 2.017824 1.511213
H  -2.154311 1.60681 -0.879763
H  -0.40377 -1.547757 1.310673
H  0.553691 2.500324 0.067123
H  -3.968267 2.401373 0.555169
H  -4.378347 0.775702 0.940253
H  -2.167067 -1.570313 -2.1341
H  4.315719 -0.105685 -0.849975
