program: Gaussian 09
title: 000208842
version: EM64L-G09RevD.01
frameworkgroup: C1[X(C15H24N2O2)]
method: RPBEPBE
basis: SDD
operation: Freq
keyword: #p
keyword: freq=noraman
keyword: PBEPBE/SDD
title: #p freq=noraman PBEPBE/SDD
converged: YES YES NO NO
title: Mulliken charges:
elementType: O O N N C C C C C C C C C C C C C C C H H H H H H H H H H H H H H H H H H H H H H H H
charge: -0.277306 -0.295815 -0.087445 -0.162215 -0.368624 -0.371597 -0.387189 -0.420001 -0.341925 -0.449131 0.322962 -0.248911 0.210999 -0.349976 -0.345941 -0.262025 -0.262828 -0.498748 -0.537560 0.192556 0.203259 0.211115 0.190870 0.198902 0.251924 0.222488 0.198361 0.191263 0.202243 0.221207 0.223239 0.214483 0.179689 0.245856 0.233936 0.220109 0.222178 0.230330 0.198486 0.198041 0.224790 0.239695 0.218255
chargesum: 0.00000
title: Mulliken charges with hydrogens summed into heavy atoms:
elementType: O O N N C C C C C C C C C C C C C C C
charge: -0.277306 -0.295815 -0.087445 -0.162215 0.027191 0.030387 0.063637 0.000848 0.051581 -0.004685 0.322962 0.145261 0.210999 -0.104119 -0.112006 -0.041916 -0.040650 0.128109 0.145180
polarizability: 2.49133873e+02 -9.46136153e+00 1.93666333e+02 4.51038320e+00 5.36299644e+00 1.23557507e+02
1716.lowfreq: -9.3886 -0.0011 -0.0003 0.0001 2.5006 10.0488 20.6445 25.1886 53.0748
frequency: 20.4705 24.5993 53.0114 64.1811 68.5194 85.5972 96.9725 108.0281 140.1366 176.4716 204.3616 208.1664 228.2648 240.6897 249.7327 273.4258 279.7430 288.4160 325.4308 327.6624 355.8014 398.6958 405.9030 468.2397 478.7453 488.5105 522.6607 537.5174 559.2326 572.7358 620.4380 701.8856 726.2674 738.0100 743.8019 769.6491 810.3776 829.9479 853.9143 867.6342 901.7760 907.5884 916.2918 952.4614 958.4316 961.8023 985.4265 1028.4097 1053.5674 1055.4927 1061.3572 1064.8227 1087.0943 1097.5469 1103.1712 1110.9102 1114.0797 1119.3064 1140.8392 1150.5591 1152.7466 1159.4393 1167.4402 1174.6234 1199.3804 1202.5551 1214.7108 1237.3756 1250.0966 1267.0791 1281.2104 1287.6230 1298.8958 1322.3460 1337.8499 1348.4027 1358.3263 1366.8098 1379.1412 1381.8067 1387.5032 1393.3678 1429.4100 1438.1657 1442.4255 1453.2588 1457.3179 1458.0449 1461.9032 1465.2372 1466.1263 1468.9631 1475.0787 1475.5195 1480.2042 1490.9530 1502.9093 1581.9217 1604.5773 2839.1081 2853.3017 2866.5906 2891.5170 2913.5799 2915.1612 2923.5417 2957.5647 2982.4581 2990.2901 2998.3941 3006.5030 3025.0154 3039.8184 3044.8632 3047.5757 3061.2983 3098.1329 3103.9069 3118.4192 3129.4416 3145.4250 3159.7562 3170.8226
redmass: 3.9694 4.3289 4.0114 2.6798 2.1789 3.4635 3.4107 3.2256 3.6380 2.9472 2.9581 3.3606 1.2040 1.7147 2.3879 2.0546 2.1988 2.9034 2.9347 2.9922 3.3319 2.0031 2.8382 3.1533 2.9694 4.5292 4.1567 3.2585 4.1714 3.7004 3.1151 3.5109 3.7364 1.6792 1.5895 4.9448 1.5033 1.4805 1.5403 1.7939 1.3804 3.5207 3.5569 1.4656 1.8106 2.2869 8.3683 2.2727 1.9531 1.9099 2.7955 3.8042 1.9642 2.2211 2.3192 1.2671 1.4084 1.8213 2.7664 1.8106 1.5682 1.5297 1.7926 1.0871 1.5622 1.8507 1.7926 1.4048 1.3793 1.1955 1.3478 1.4969 1.3713 1.3054 1.3407 1.3741 1.6257 1.4823 1.5077 1.8249 3.0657 1.4162 1.5018 1.1599 1.5760 1.0850 1.0515 1.1247 1.1024 1.0941 1.0517 1.0688 1.0880 1.0849 1.0924 1.0807 2.5659 6.5051 6.3544 1.0709 1.0706 1.0690 1.0689 1.0509 1.0695 1.0455 1.0326 1.0992 1.1025 1.0800 1.0683 1.0896 1.0899 1.1037 1.0894 1.1016 1.0968 1.0897 1.0995 1.0847 1.0893 1.0928 1.0994
irintensity: 0.2779 0.0820 0.5104 4.1834 3.2170 2.4824 6.8200 1.0660 5.5808 1.5730 0.7908 3.2614 2.2880 1.3166 2.1489 1.4620 0.6382 3.0619 3.2670 7.4375 3.9004 0.6778 1.5746 3.9666 2.5762 1.1958 1.5752 8.5642 1.2314 3.7876 2.3925 9.8145 1.9532 28.5045 86.0198 4.7494 1.5325 0.1229 0.8389 8.1597 4.1039 6.1191 19.1994 0.2192 1.2826 34.7544 60.3779 60.5883 16.1560 7.0973 12.5737 108.6241 7.8599 4.4251 39.7894 0.1308 7.4436 11.9430 62.5028 28.8230 11.9695 3.4908 21.7234 0.6203 33.9831 80.0158 5.3741 107.0555 64.1114 7.5182 11.8912 7.3283 36.7839 8.0372 9.8604 5.0591 12.4465 0.9832 10.3287 45.4736 4.2370 3.5915 6.9903 0.5158 25.9235 4.7992 10.5845 10.6300 45.6525 10.7690 10.4167 24.0577 40.9877 7.8446 11.4751 6.5297 140.6298 8.1277 78.5093 66.5776 57.3504 125.5274 87.6483 72.5588 88.7828 101.0029 74.1997 62.5410 62.2227 13.1426 37.7512 53.5057 49.3981 45.3763 27.3280 65.8104 39.1200 7.4157 21.8425 2.2681 18.5407 34.9751 13.6845
temp: 298.150 k
press: 1.00000 atm
elementType: 8 8 7 7 6 6 6 6 6 6 6 6 6 6 6 6 6 6 6 1 1 1 1 1 1 1 1 1 1 1 1 1 1 1 1 1 1 1 1 1 1 1 1
symmnumber: 1
zpe: 970697.9 jmol-1
zpe.correction: 0.369719 hartree
zpe.thermalcorrener: 0.389380 hartree
zpe.thermalcorrenthalpy: 0.390324 hartree
zpe.thermalcorrgfe: 0.320037 hartree
zpe.sumelectzpe: -844.394378 hartree
zpe.sumelectthermal: -844.374718 hartree
zpe.sumelectthermalent: -844.373774 hartree
zpe.sumelectthermalfe: -844.444060 hartree
dipole: -1.3564 -1.3578 -1.1965
dipole: 2.2616
quadrupole: -112.7867 -104.6300 -116.9500
quadrupole: 8.5778 -4.9689 1.1410
quadrupole: -1.3312 6.8256 -5.4944 8.5778 -4.9689 1.1410
hfenergy: -844.7640976 hartree
pointgroup: C01 [X(C15H24N2O2)]
dipole: 0.5244169 -0.5272057 0.4886529 debye
polarizability: 249.5942887|8.2714269|192.7061697|3.1918043|-8.2961036|124.057255 unknown
InChI: InChI=1S/C15H24N2O2/c1-18-13-5-8-16-9-11-17(12-10-16)14-6-3-4-7-15(14)19-2/h3-4,6-7H,5,8-13H2,1-2H3
charge 0 multiplicity 1
43 atoms
O  -5.993922 0.825604 0.046803
O  3.0307 -1.678213 0.264282
N  -1.93162 -0.843091 -0.095406
N  0.841272 0.017793 -0.156281
C  -0.846369 -1.707507 0.43348
C  -1.405475 -0.007739 -1.201433
C  0.332778 -0.858927 0.930845
C  -0.226759 0.861228 -0.727119
C  -3.129407 -1.633182 -0.480081
C  -4.376198 -0.7704 -0.764414
C  2.151964 0.55304 -0.070421
C  -4.747363 0.138309 0.410585
C  3.296419 -0.296395 0.13875
C  2.407478 1.94096 -0.257187
C  4.600626 0.240566 0.179136
C  3.716452 2.472634 -0.240194
C  4.818497 1.626015 -0.013407
C  -6.429142 1.760005 1.07975
C  4.176182 -2.580584 0.379525
H  -0.472975 -2.419975 -0.345675
H  -1.246849 -2.300106 1.277662
H  -2.205232 0.659677 -1.569616
H  -1.062878 -0.641587 -2.059536
H  -0.010501 -0.235049 1.788504
H  1.146132 -1.516745 1.268614
H  0.174037 1.413255 -1.595881
H  -0.605888 1.604579 0.014925
H  -2.924447 -2.279076 -1.373703
H  -3.35175 -2.317361 0.36297
H  -4.240052 -0.150191 -1.669705
H  -5.229302 -1.44308 -0.975477
H  -3.940727 0.874863 0.611756
H  -4.896761 -0.462392 1.337349
H  1.563606 2.621857 -0.40107
H  5.459797 -0.417941 0.339391
H  3.864906 3.547597 -0.389936
H  5.837575 2.02565 0.012706
H  -7.356697 2.225222 0.709711
H  -5.668976 2.550264 1.26329
H  -6.636958 1.24137 2.0410
H  4.843771 -2.496547 -0.499975
H  3.741726 -3.590743 0.420404
H  4.756128 -2.386756 1.303179
