program: Gaussian 09
title: 000208841
version: EM64L-G09RevD.01
frameworkgroup: C1[X(C23H31FO4)]
method: RPBEPBE
basis: SDD
operation: Freq
keyword: #p
keyword: freq=noraman
keyword: PBEPBE/SDD
title: #p freq=noraman PBEPBE/SDD
converged: YES YES NO NO
title: Mulliken charges:
elementType: F O O O O C C C C C C C C C C C C C C C C C C C C C C C H H H H H H H H H H H H H H H H H H H H H H H H H H H H H H H
charge: -0.221376 -0.460660 -0.241136 -0.445499 -0.251586 0.358351 -0.111914 -0.272228 0.241523 0.316023 -0.600139 -0.079460 -0.644346 -0.244693 0.025794 -0.439485 -0.856473 -0.867651 -0.665156 0.059409 0.634221 -0.792251 -0.767551 -0.176928 -0.383986 -0.652980 -0.400575 0.190642 0.260813 0.258138 0.234000 0.225459 0.274159 0.262814 0.219344 0.251301 0.228305 0.236629 0.268267 0.248002 0.219724 0.241980 0.232678 0.244866 0.220783 0.243812 0.224043 0.220998 0.224182 0.239838 0.218016 0.284330 0.264501 0.355225 0.232803 0.235545 0.261618 0.252322 0.365617
chargesum: 0.00000
title: Mulliken charges with hydrogens summed into heavy atoms:
elementType: F O O O O C C C C C C C C C C C C C C C C C C C C C C C
charge: -0.221376 -0.105435 -0.241136 -0.079882 -0.251586 0.358351 0.148899 -0.014090 0.241523 0.316023 -0.140680 0.194700 -0.162188 0.006608 0.025794 0.025449 -0.120480 -0.148128 -0.200561 0.059409 0.634221 -0.123028 -0.025367 0.087572 0.084362 -0.391362 -0.148254 0.190642
polarizability: 3.25821298e+02 1.45045629e+00 2.32663637e+02 -2.73382070e+01 5.18218293e+00 2.04946196e+02
1716.lowfreq: -12.5697 -7.8580 -0.0004 0.0002 0.0004 3.7725 26.3162 39.0220 48.8804
frequency: 26.2527 38.8534 48.8269 59.7104 74.0267 75.1450 110.8020 126.5253 142.5899 160.2152 178.3671 181.7857 198.2430 206.5770 213.1648 222.2295 233.9448 241.0779 250.6495 252.5053 265.3215 267.8366 270.7114 291.2792 301.3579 306.9048 310.9913 322.2116 330.8599 342.0161 360.9127 374.3700 378.8775 406.6060 412.8978 419.7461 433.8723 455.1936 471.7796 476.7769 485.4387 496.8241 513.2109 521.8111 525.5027 562.5948 583.4201 589.7162 629.9481 654.8299 668.0102 688.6635 699.8122 724.2387 753.1555 765.1542 801.7716 815.8383 828.3890 844.1965 857.1732 866.6680 870.5867 898.4914 906.2266 914.1012 920.5098 927.9826 947.0628 953.7752 961.3499 971.3779 977.7762 993.4457 999.2709 1002.2331 1029.2147 1030.4217 1049.3329 1055.7815 1059.6750 1063.5935 1072.3471 1090.8433 1101.0141 1107.6416 1113.7944 1118.8890 1140.4914 1144.9214 1156.1565 1162.2118 1165.0849 1169.4496 1177.6029 1190.0849 1206.6232 1211.4602 1221.1075 1231.3631 1248.5530 1256.5894 1261.4540 1276.5051 1285.6645 1291.4889 1301.9856 1312.1155 1312.5865 1324.4978 1333.4108 1346.8864 1349.8333 1351.7193 1359.5660 1369.8013 1376.2292 1383.0777 1384.1695 1389.0430 1393.6845 1401.7439 1406.4080 1441.4024 1459.0126 1462.1819 1465.9649 1466.5863 1467.6176 1471.5179 1476.4919 1485.7677 1489.7099 1493.1350 1493.3157 1498.0127 1557.7220 1583.0138 1619.9075 1667.9747 2949.8327 2958.5794 2968.2253 2973.9397 2976.7361 2977.4143 2984.5237 2987.9781 2993.4497 2997.3855 3001.5753 3001.9689 3005.7531 3013.5091 3045.9894 3046.6824 3050.3161 3061.6605 3067.6476 3071.5645 3074.3775 3080.2496 3089.1921 3093.9830 3107.5200 3109.5134 3129.7145 3132.4259 3150.3945 3400.7265 3567.6536
redmass: 6.5564 4.6065 7.9102 6.5877 3.2355 3.4663 4.2333 2.8774 3.2949 3.9509 2.9278 2.7805 2.8569 2.5859 3.5080 2.2790 2.7982 2.3337 2.0773 1.9716 1.8777 1.8440 1.2970 3.0166 1.2048 2.1066 2.9119 2.7626 3.5213 3.5704 3.5263 3.1604 3.7190 3.1045 3.3601 3.9882 1.8646 2.3463 3.4741 3.7954 1.8664 3.3612 3.9661 2.6038 3.9048 2.8665 3.9073 3.2414 3.9052 3.1696 4.0448 3.0813 3.9544 3.7139 3.7051 3.2616 3.1009 2.0566 1.7103 2.7092 2.6862 2.8294 2.9928 2.1273 1.7846 1.7485 1.7835 2.2019 2.2084 1.7627 2.2861 1.8550 2.8952 2.1281 1.9324 1.3522 2.3932 2.9013 2.4934 2.8325 1.9584 2.2768 2.2286 3.0408 2.1305 1.9180 1.6426 2.7091 2.0833 2.2312 2.4656 2.0398 2.2783 1.7474 1.8280 1.2312 1.3340 2.2536 1.7030 1.5135 1.4980 1.6041 1.5121 1.5085 1.4368 2.1070 1.3419 1.4690 1.5133 1.3384 1.4014 1.8147 1.3313 1.4039 1.3485 1.3772 1.9881 1.3582 1.3434 1.2184 1.4882 1.1857 1.1972 1.0773 1.0823 1.0834 1.0596 1.0770 1.0775 1.0556 1.0486 1.0674 1.0613 1.0558 1.0546 1.0543 8.6498 7.7433 8.5287 7.4217 1.0627 1.0672 1.0652 1.0375 1.0763 1.0834 1.0636 1.0422 1.0379 1.0607 1.0919 1.0530 1.0678 1.0840 1.1004 1.0953 1.0927 1.1031 1.0988 1.0992 1.0928 1.0984 1.0985 1.0993 1.0999 1.0869 1.0921 1.0988 1.0979 1.0638 1.0660
irintensity: 3.6901 2.1298 0.7265 0.2101 4.2951 1.6237 0.7164 2.4754 0.3765 3.8512 3.5677 1.0712 6.1479 1.5804 0.8959 1.5891 3.0744 1.6524 9.5391 1.3905 49.5952 6.5627 0.7266 15.6121 94.9602 5.0660 5.7600 2.2887 8.9248 6.7789 2.2409 1.5451 12.7991 2.7098 23.3476 2.2286 38.9887 13.8483 3.1432 5.5761 49.8858 9.2144 0.5651 9.7618 3.5003 3.1545 4.8894 2.6314 6.8723 0.3765 6.3872 10.4750 4.8322 4.3906 4.1922 4.0909 5.3284 6.7932 12.6579 1.5473 13.1312 24.5563 14.2501 19.0272 20.7514 0.5096 4.0880 4.8646 20.7498 1.4599 31.2424 1.7115 198.5488 25.0613 5.1440 1.2015 6.5797 8.4218 39.4262 1.3939 17.3335 8.2171 5.4784 4.1505 10.0179 15.2318 15.2664 5.3530 12.8534 10.7394 1.1812 4.6185 15.8108 12.7917 9.8480 3.6577 5.2144 8.0601 6.3211 7.5892 53.6045 104.1792 5.6712 0.3992 22.7399 20.4699 17.1879 4.6966 0.2877 2.6699 1.0208 3.9516 0.5782 3.5898 7.8202 3.5170 19.1257 36.1270 43.2579 11.2905 37.4126 40.7439 12.3161 8.5379 7.6235 13.8943 25.0673 2.9185 21.3053 3.9394 3.2307 10.0912 15.9427 9.5899 0.6157 4.7712 197.9768 78.8990 14.2873 137.0126 34.1619 32.3912 21.0061 30.4875 5.9257 40.5236 23.6675 20.0361 16.9853 27.1112 22.3967 10.8303 30.9053 4.5956 11.1818 32.9657 19.5207 24.3404 31.7587 36.8684 27.2205 16.8141 27.7699 31.9444 12.6253 5.3231 9.3954 3.2471 12.8923 28.1690 7.5385
temp: 298.150 k
press: 1.00000 atm
elementType: 9 8 8 8 8 6 6 6 6 6 6 6 6 6 6 6 6 6 6 6 6 6 6 6 6 6 6 6 1 1 1 1 1 1 1 1 1 1 1 1 1 1 1 1 1 1 1 1 1 1 1 1 1 1 1 1 1 1 1
symmnumber: 1
zpe: 1296862.7 jmol-1
zpe.correction: 0.493949 hartree
zpe.thermalcorrener: 0.521344 hartree
zpe.thermalcorrenthalpy: 0.522288 hartree
zpe.thermalcorrgfe: 0.439133 hartree
zpe.sumelectzpe: -1293.608460 hartree
zpe.sumelectthermal: -1293.581065 hartree
zpe.sumelectthermalent: -1293.580120 hartree
zpe.sumelectthermalfe: -1293.663276 hartree
dipole: -3.6911 1.5033 2.0010
dipole: 4.4596
quadrupole: -233.6374 -159.9120 -170.8501
quadrupole: -8.0666 23.8498 0.8767
quadrupole: -45.5043 28.2212 17.2831 -8.0666 23.8498 0.8767
hfenergy: -1294.1024084 hartree
pointgroup: C01 [X(C23H31F1O4)]
dipole: -1.4707586 -0.582172 -0.759185 debye
polarizability: 326.8513874|-1.8919274|232.6595709|24.9179108|5.1379285|203.920172 unknown
InChI: InChI=1S/C23H31FO4/c1-13-9-17-16-6-5-14-10-15(26)7-8-20(14,2)23(16,24)18(27)11-21(17,3)22(13,4)19(28)12-25/h7-8,10,13,16-18,25,27H,5-6,9,11-12H2,1-4H3
charge 0 multiplicity 1
59 atoms
F  1.47778 -0.079516 1.345259
O  0.432661 2.284703 -1.24717
O  -5.06198 0.271687 -0.848425
O  -5.634436 2.593824 0.280257
O  6.38782 0.251143 1.46136
C  -1.768555 0.181268 -0.152079
C  -0.879212 -1.09628 -0.02723
C  0.505406 -0.957035 -0.697048
C  -3.125183 -0.365869 0.541826
C  1.255156 0.265327 -0.098727
C  -1.794932 -2.260068 -0.471009
C  -3.253607 -1.8050 -0.110515
C  -1.026586 1.326837 0.575924
C  0.414307 1.570383 0.045922
C  2.713386 0.445381 -0.691427
C  1.34107 -2.249991 -0.498517
C  -2.059371 0.567114 -1.629383
C  -3.022267 -0.41753 2.091232
C  2.81006 -2.117131 -0.980728
C  -4.314782 0.517087 0.144884
C  3.464509 -0.865935 -0.431362
C  -4.031083 -2.840272 0.727424
C  2.698913 0.70123 -2.244431
C  3.396015 1.65211 -0.071513
C  -4.634586 1.789681 0.946978
C  4.647374 -0.898335 0.252426
C  4.577843 1.59341 0.601127
C  5.284808 0.30768 0.821726
H  -0.66525 -1.230267 1.052609
H  0.374606 -0.773982 -1.781241
H  -1.70397 -2.446944 -1.558728
H  -1.532595 -3.203474 0.041392
H  -3.825226 -1.662805 -1.045739
H  -0.930178 1.089932 1.651055
H  -1.577057 2.289341 0.505622
H  0.939761 2.192712 0.799409
H  0.85041 -3.082961 -1.035006
H  1.341084 -2.502792 0.57842
H  -1.127434 0.741975 -2.188634
H  -2.647705 -0.205006 -2.151376
H  -2.646419 1.503863 -1.681467
H  -2.185445 -1.057522 2.417908
H  -2.869431 0.579225 2.540181
H  -3.943207 -0.839813 2.529468
H  2.823548 -2.09114 -2.089908
H  3.386091 -3.009705 -0.677691
H  -4.129864 -3.782619 0.157779
H  -3.518928 -3.081104 1.677106
H  -5.053655 -2.490584 0.963025
H  3.742512 0.765425 -2.598459
H  2.20079 -0.114134 -2.795308
H  2.17513 1.640546 -2.471175
H  2.910967 2.61867 -0.261999
H  -0.262523 2.98935 -1.22508
H  -3.71622 2.392988 1.090574
H  -4.992894 1.489679 1.955401
H  5.177897 -1.844406 0.417573
H  5.063381 2.49186 0.999499
H  -5.987705 2.03489 -0.471489
