program: Gaussian 09
title: 000208835
version: EM64L-G09RevD.01
frameworkgroup: C1[X(C10H17N5O4)]
method: RPBEPBE
basis: SDD
operation: Freq
keyword: #p
keyword: freq=noraman
keyword: PBEPBE/SDD
title: #p freq=noraman PBEPBE/SDD
converged: YES YES NO NO
title: Mulliken charges:
elementType: O O O O N N N N N C C C C C C C C C C H H H H H H H H H H H H H H H H H
charge: -0.504031 -0.491600 -0.442782 -0.281963 -0.467168 -0.407365 -0.457464 -0.024337 -0.627135 -0.165756 -0.114552 -0.135592 -0.417365 -0.065841 0.075277 0.336666 -0.710409 -0.038375 0.140460 0.275688 0.253637 0.211573 0.221377 0.253923 0.322419 0.216410 0.292461 0.379265 0.239635 0.193037 0.245239 0.381469 0.302509 0.354855 0.351282 0.304553
chargesum: 0.00000
title: Mulliken charges with hydrogens summed into heavy atoms:
elementType: O O O O N N N N N C C C C C C C C C C
charge: -0.124766 -0.110131 -0.087927 -0.281963 -0.144749 -0.114904 -0.154955 -0.024337 0.028700 0.109932 0.139085 0.075980 0.057936 0.150569 0.075277 0.336666 -0.032498 -0.038375 0.140460
polarizability: 2.20071032e+02 5.11316468e+00 1.65428895e+02 5.98249160e+00 -7.38894545e+00 1.03342217e+02
1716.lowfreq: -7.3874 -0.0007 -0.0002 0.0004 1.3725 9.0867 30.7677 32.8215 58.1662
frequency: 30.6884 32.6960 58.1426 79.6811 108.9471 119.9716 138.8106 142.9060 184.6009 192.1741 217.4784 226.3641 240.0971 247.2638 270.1755 276.9778 293.0007 299.4869 336.6126 340.2191 377.5821 454.5502 458.7848 472.5595 475.7512 490.1363 516.9823 526.9691 532.9661 546.0374 553.1938 580.3834 591.1993 614.9260 644.5567 664.5718 683.0750 697.2003 736.3940 745.7400 822.9547 833.1463 861.7238 911.4146 915.1323 950.0102 958.5225 1008.6173 1022.5992 1030.9242 1042.8859 1067.6693 1082.8670 1102.8134 1117.8913 1129.0055 1165.8303 1190.6088 1217.1368 1232.7449 1238.8214 1264.0526 1269.1789 1285.1825 1298.8498 1307.7592 1315.4900 1324.7863 1331.8548 1351.4549 1370.7336 1372.4388 1375.6007 1385.2124 1402.5606 1433.5757 1462.0734 1465.9658 1476.3818 1477.1691 1522.6145 1560.5277 1588.5699 1630.3947 1695.7480 2945.6055 2966.5646 2972.3412 2981.2443 2986.0044 3021.1236 3049.6931 3079.6309 3106.2707 3383.7105 3408.3773 3487.1073 3500.3589 3533.7129 3543.6087 3547.4319 3692.3502
redmass: 5.5911 5.5186 4.2972 4.6711 5.5461 3.6051 5.5846 5.8442 2.4322 6.4721 3.0256 1.2817 3.0337 1.3086 2.2889 1.9321 3.6053 4.3894 3.4142 5.1482 4.0357 3.0893 2.7201 2.8018 2.0038 2.1301 1.4674 2.9019 1.2554 1.9758 2.1196 2.2460 3.2400 3.1183 2.9485 4.2475 5.9925 3.7259 3.9190 2.4264 3.4798 3.1443 3.3756 2.2975 2.6298 2.3078 4.1126 2.3439 2.2654 2.7605 2.2266 2.4450 2.8846 2.1187 2.2406 3.0569 2.9314 1.2534 1.2670 1.4351 2.2895 2.1475 1.3279 1.3357 1.6613 1.1867 1.2773 1.2702 1.3844 1.6613 1.3973 2.3056 1.3925 1.2141 1.6785 1.9204 2.0545 1.0590 1.1240 1.2595 2.6071 7.4910 1.7856 1.9202 7.1153 1.0825 1.0829 1.0651 1.0540 1.0659 1.0858 1.1004 1.0964 1.1010 1.0644 1.0745 1.0644 1.0651 1.0753 1.0475 1.0769 1.1041
irintensity: 1.9562 2.9128 3.4459 8.5448 5.3877 4.1508 10.7301 11.6738 18.2403 4.1282 1.9760 1.2881 37.8706 61.5193 69.4401 66.3058 0.2512 3.8411 11.4276 4.3269 7.8633 3.5085 6.5806 48.2347 144.2088 126.7967 115.1935 51.1161 176.1246 111.5167 58.3225 35.2144 31.4105 40.6253 19.9885 1.7198 16.4466 26.2567 96.1051 95.5374 29.0918 21.1492 10.5119 4.8015 8.9615 92.0223 3.8987 20.0055 64.1502 20.4586 27.0677 29.8994 9.0781 49.3914 89.8689 1.7347 13.3909 103.7564 11.1273 79.2776 13.2639 11.7451 20.5290 18.8141 220.3500 33.7688 12.1378 4.6826 18.4129 65.5561 105.2209 6.4791 84.4945 43.9935 4.1541 101.4395 7.6568 13.7912 15.7453 25.8997 216.2734 380.6617 89.5074 515.8064 243.1968 41.0566 7.8549 31.4377 17.2389 83.0674 36.7377 33.5769 40.0854 20.1964 144.1618 30.8378 22.1075 39.4952 18.2857 91.8394 18.9990 40.4187
temp: 298.150 k
press: 1.00000 atm
elementType: 8 8 8 8 7 7 7 7 7 6 6 6 6 6 6 6 6 6 6 1 1 1 1 1 1 1 1 1 1 1 1 1 1 1 1 1
symmnumber: 1
zpe: 755301.1 jmol-1
zpe.correction: 0.287679 hartree
zpe.thermalcorrener: 0.306960 hartree
zpe.thermalcorrenthalpy: 0.307904 hartree
zpe.thermalcorrgfe: 0.240416 hartree
zpe.sumelectzpe: -964.444247 hartree
zpe.sumelectthermal: -964.424966 hartree
zpe.sumelectthermalent: -964.424022 hartree
zpe.sumelectthermalfe: -964.491510 hartree
dipole: -2.9287 -10.1562 2.5217
dipole: 10.8667
quadrupole: -107.5739 -109.7498 -120.4546
quadrupole: 27.9872 -3.2989 1.5799
quadrupole: 5.0188 2.8430 -7.8618 27.9872 -3.2989 1.5799
hfenergy: -964.7319259 hartree
pointgroup: C01 [X(C10H17N5O4)]
dipole: 1.0420497 -3.9692772 -1.1987096 debye
polarizability: 219.9183684|-6.5825461|164.8554913|4.4538557|10.3124103|104.0682848 unknown
InChI: InChI=1S/C10H17N5O4/c1-3(16)6(17)7(18)4-2-12-8-5(13-4)9(19)15-10(11)14-8/h3-4,6-7,12-14,16-18H,2,11H2,1H3
charge 0 multiplicity 1
36 atoms
O  -1.89745 1.252012 -1.631655
O  -4.426276 0.709672 -1.024496
O  -4.394925 0.707019 1.703484
O  2.476926 2.466124 0.721333
N  0.298679 0.898079 -0.045588
N  0.781373 -1.869496 -0.471094
N  3.145145 -1.477529 -0.152508
N  4.02357 0.710623 0.351062
N  5.471054 -1.126893 0.131507
C  -0.823071 -0.050047 0.16408
C  -2.10567 0.702983 -0.278129
C  -3.399148 -0.126253 -0.378029
C  -0.571171 -1.31714 -0.701874
C  -3.992601 -0.518371 0.996354
C  1.611569 0.36127 0.017337
C  1.829325 -0.983615 -0.220764
C  -5.171298 -1.497678 0.853211
C  2.712879 1.2547 0.393227
C  4.194436 -0.580037 0.108599
H  -0.916167 -0.354986 1.228773
H  -2.282932 1.534392 0.437787
H  -3.225561 -1.031152 -0.996244
H  -1.307818 -2.093975 -0.429309
H  -0.724899 -1.045963 -1.766147
H  0.255003 1.79921 0.456355
H  -3.20479 -0.963909 1.631936
H  0.984597 -2.779147 -0.887838
H  -0.943227 1.555594 -1.653096
H  -5.637839 -1.662097 1.839025
H  -4.834667 -2.474981 0.457017
H  -5.929179 -1.087505 0.163209
H  -3.958096 1.229035 -1.733064
H  3.303565 -2.485077 -0.092728
H  -4.90862 1.238853 1.035509
H  6.218228 -0.477108 0.36791
H  5.704753 -1.991508 -0.350751
