program: Gaussian 09
title: 000208832
version: EM64L-G09RevD.01
frameworkgroup: C1[X(C14H20Cl2N2O2)]
method: RPBEPBE
basis: SDD
operation: Freq
keyword: #p
keyword: freq=noraman
keyword: PBEPBE/SDD
title: #p freq=noraman PBEPBE/SDD
converged: YES YES NO NO
title: Mulliken charges:
elementType: Cl Cl O O N N C C C C C C C C C C C C C C H H H H H H H H H H H H H H H H H H H H
charge: -0.010729 -0.053866 -0.240432 -0.269452 -0.091644 -0.358083 -0.357399 -0.325732 -0.326948 -0.397249 -0.673848 -0.701162 0.152238 0.207478 0.304611 -0.362780 -0.282400 -0.112045 -0.230408 -0.525049 0.245056 0.201834 0.202651 0.183860 0.204520 0.185400 0.265120 0.226928 0.317069 0.208689 0.224381 0.211940 0.256975 0.213965 0.206996 0.277298 0.284483 0.284655 0.214934 0.238145
chargesum: 0.00000
title: Mulliken charges with hydrogens summed into heavy atoms:
elementType: Cl Cl O O N N C C C C C C C C C C C C C C
charge: -0.010729 -0.053866 -0.240432 -0.269452 -0.091644 -0.041014 0.089491 0.060780 0.062972 0.094800 -0.028838 -0.023226 0.152238 0.207478 0.304611 -0.085482 -0.282400 -0.112045 0.054076 0.212684
polarizability: 2.62729520e+02 4.08040382e+00 2.22348016e+02 -8.73472085e+00 -9.63194121e-01 1.22713846e+02
1716.lowfreq: -7.9638 -0.0026 -0.0016 -0.0002 1.2387 5.6796 17.9658 23.2913 25.9601
frequency: 17.4524 23.2533 25.7457 40.6785 56.9020 72.8886 79.1474 96.8369 112.6230 120.4540 139.4098 161.3831 171.5410 176.0930 207.9528 238.3586 247.8349 252.0929 268.3506 284.7899 294.6842 296.5421 318.0187 332.0100 366.9124 369.6755 387.2154 402.4703 414.1262 457.6791 510.4774 527.8787 549.6981 573.3780 579.4910 640.0674 703.1677 724.5467 747.8212 759.0343 770.3377 790.7802 797.7624 810.6009 859.1811 867.6559 882.0050 919.4148 972.8008 987.7163 999.5639 1037.0790 1068.2816 1074.5649 1082.9374 1091.1016 1093.2469 1115.6851 1124.5642 1131.2773 1157.3415 1177.5439 1201.7001 1212.3680 1241.7551 1245.7242 1260.8058 1284.8828 1289.4353 1309.6971 1326.8190 1353.4640 1364.7478 1367.3771 1377.7294 1381.0723 1388.9066 1396.8279 1406.7012 1440.7125 1456.5546 1459.7220 1464.5760 1466.1539 1472.2231 1475.2380 1476.5120 1477.6769 1485.1149 1491.9049 1502.0872 1549.8380 1581.6029 1593.5115 2844.2181 2852.7591 2952.9990 2980.2759 2981.9565 2986.2662 3008.0029 3020.0074 3030.5534 3036.2671 3076.9249 3080.0400 3085.4250 3092.3433 3095.2932 3099.4557 3133.4455 3160.2844 3183.9555 3553.8854
redmass: 3.8651 5.6182 5.4644 3.5601 3.0564 2.6258 4.0622 4.7959 5.0451 2.2130 4.2232 4.1888 3.9474 10.0864 2.7454 2.2870 1.6599 1.4632 2.6230 2.5313 1.8391 2.0047 3.0867 9.5937 5.3296 6.3617 3.0112 7.3018 4.3249 2.5724 3.0646 5.6939 2.4396 1.4622 5.5095 6.6339 3.1902 7.4602 2.2212 3.0361 2.7503 4.6336 1.1937 1.2505 3.7840 1.4070 1.4339 1.9355 8.7071 2.7259 4.0709 3.5171 1.9654 2.3942 2.6664 1.6870 1.9221 1.2711 1.7164 2.8984 1.5855 1.7780 1.6530 2.3860 3.5413 1.7751 1.6568 1.2144 1.1796 1.2712 1.2094 1.2977 1.3764 4.8770 4.0029 1.3320 1.2349 1.2244 2.1221 1.1702 1.2719 1.2563 1.0809 1.0588 1.0862 1.0742 1.3992 1.2537 1.0565 1.0623 1.0619 7.3600 7.3934 7.1057 1.0719 1.0709 1.0582 1.0356 1.0334 1.0357 1.0995 1.0910 1.0608 1.0873 1.0988 1.0983 1.1007 1.1004 1.0989 1.1060 1.1057 1.0922 1.0936 1.0783
irintensity: 0.1918 0.0329 0.6180 0.3601 1.3117 0.3411 2.1580 5.6036 1.1918 0.8344 4.1836 2.8912 2.8491 0.5147 3.6401 0.0432 0.1952 0.9920 0.4261 7.3532 2.9108 2.2288 10.5812 2.7888 1.8787 0.7404 4.5278 5.4021 6.6968 2.9001 9.4708 24.4126 49.8127 43.4557 6.6776 30.8310 21.0282 9.4085 8.7080 4.7416 42.1826 30.6249 7.0410 10.6043 6.1836 25.4441 6.5222 0.1140 20.9630 1.9872 27.5514 2.6122 21.2191 15.4874 17.5219 37.3139 1.8077 1.2115 18.2366 20.9486 4.6652 25.3111 20.7949 45.2081 111.3955 87.6958 126.3424 18.7911 3.6358 9.9855 9.5653 17.9700 0.9519 12.4019 45.2707 4.2109 26.7999 12.1108 76.1471 68.3958 87.9466 63.5013 16.3273 9.0934 6.1420 61.8024 128.6515 76.6509 20.1594 12.1122 16.4880 20.6335 76.8909 54.9267 36.0355 197.2639 36.0332 24.5315 50.0488 35.0409 5.8367 33.7395 32.9884 35.1245 37.2322 54.8645 33.9916 45.5275 27.2225 12.3218 13.1277 0.4445 0.9869 22.6710
temp: 298.150 k
press: 1.00000 atm
elementType: 17 17 8 8 7 7 6 6 6 6 6 6 6 6 6 6 6 6 6 6 1 1 1 1 1 1 1 1 1 1 1 1 1 1 1 1 1 1 1 1
symmnumber: 1
zpe: 841082.0 jmol-1
zpe.correction: 0.320351 hartree
zpe.thermalcorrener: 0.342867 hartree
zpe.thermalcorrenthalpy: 0.343812 hartree
zpe.thermalcorrgfe: 0.265530 hartree
zpe.sumelectzpe: -1723.990768 hartree
zpe.sumelectthermal: -1723.968252 hartree
zpe.sumelectthermalent: -1723.967308 hartree
zpe.sumelectthermalfe: -1724.045590 hartree
dipole: 3.4245 1.2932 -2.9208
dipole: 4.6830
quadrupole: -136.6567 -135.1615 -132.8521
quadrupole: 2.5588 1.6233 2.6500
quadrupole: -1.7666 -0.2714 2.0380 2.5588 1.6233 2.6500
hfenergy: -1724.3111197 hartree
pointgroup: C01 [X(C14H20Cl2N2O2)]
dipole: -1.2990223 -0.0256892 1.3063354 debye
polarizability: 261.6950218|2.9264488|206.5454715|-15.5081764|36.0136944|139.5508889 unknown
InChI: InChI=1S/C14H20Cl2N2O2/c1-4-18(5-2)7-6-17-14(19)11-8-10(15)9-12(16)13(11)20-3/h8-9,17H,4-7H2,1-3H3
charge 0 multiplicity 1
40 atoms
Cl 5.536673 -0.87519 -0.835634
Cl 3.256564 3.783994 1.117645
O  2.846843 -1.945523 -0.734536
O  -0.227898 -0.862053 -1.132714
N  -4.277019 0.280351 0.261965
N  -0.574108 -0.174802 1.06112
C  -2.849661 0.662271 0.367753
C  -5.208533 1.162384 1.012594
C  -4.713075 -0.011537 -1.129012
C  -2.019309 -0.473576 1.027605
C  -6.530662 0.468131 1.395649
C  -3.997644 -1.226807 -1.750183
C  0.225688 -0.362655 -0.052597
C  1.651536 0.121673 0.095906
C  2.79781 -0.626798 -0.320719
C  1.814485 1.463524 0.544213
C  4.063758 0.034767 -0.30533
C  3.081375 2.059338 0.556811
C  4.224433 1.360751 0.12285
C  1.766415 -2.905726 -0.449586
H  -2.414442 0.870053 -0.631253
H  -2.736666 1.589554 0.965358
H  -4.696106 1.46901 1.944047
H  -5.434239 2.103404 0.447628
H  -5.799017 -0.213882 -1.106394
H  -4.565158 0.881292 -1.790213
H  -2.171547 -1.3988 0.447868
H  -2.373259 -0.649508 2.05818
H  -0.149205 0.177705 1.920179
H  -7.148394 1.140599 2.01968
H  -6.32315 -0.454805 1.965144
H  -7.130289 0.195482 0.509008
H  -2.90523 -1.076858 -1.822915
H  -4.184741 -2.13204 -1.144872
H  -4.379413 -1.405771 -2.772562
H  0.934275 2.048531 0.82636
H  5.212463 1.82714 0.122552
H  0.942825 -2.781907 -1.169569
H  1.386851 -2.777886 0.582056
H  2.246271 -3.890231 -0.553787
