program: Gaussian 09
title: 000208827
version: EM64L-G09RevD.01
frameworkgroup: C1[X(C5H8N4O4S)]
method: RPBEPBE
basis: SDD
operation: Freq
keyword: #p
keyword: freq=noraman
keyword: PBEPBE/SDD
title: #p freq=noraman PBEPBE/SDD
converged: YES YES NO NO
title: Mulliken charges:
elementType: S O O O O N N N N C C C C C H H H H H H H H
charge: 0.957715 -0.535960 -0.497576 -0.259523 -0.201256 -0.143482 -0.089078 -0.012731 -0.077189 -0.670557 0.060852 0.342544 -0.608347 -0.492597 0.316818 0.338272 0.267252 0.291650 0.264177 0.254472 0.241242 0.253301
chargesum: 0.00000
title: Mulliken charges with hydrogens summed into heavy atoms:
elementType: S O O O O N N N N C C C C C
charge: 0.957715 -0.535960 -0.497576 -0.259523 -0.201256 -0.143482 -0.089078 -0.012731 -0.077189 -0.015467 0.060852 0.342544 0.214732 0.256418
polarizability: 1.33749202e+02 -1.02130880e+01 1.16917714e+02 3.94506254e+00 -7.45075887e-01 1.07012249e+02
1716.lowfreq: -5.9779 0.0019 0.0021 0.0022 5.1187 8.4997 22.0109 41.4856 46.8186
frequency: 21.9348 41.4398 46.7818 76.6029 100.0316 102.5662 103.3082 136.7851 165.5640 191.8546 209.1532 233.4475 246.8087 253.4690 288.5873 323.5358 378.8020 394.1299 439.4120 508.7599 623.3527 647.9724 661.2827 674.2217 688.9960 779.1864 799.1589 861.8027 895.8660 905.7970 940.4983 978.5218 980.5688 1072.8373 1106.3971 1114.0546 1114.8840 1135.9730 1153.2857 1199.8633 1211.1219 1221.8312 1299.1191 1386.8252 1393.7540 1424.2381 1453.4003 1454.9300 1460.8103 1470.0259 1488.2530 1645.8151 3013.6937 3014.6070 3049.2841 3114.3515 3121.0128 3144.9280 3162.6032 3166.2715
redmass: 5.4661 5.2257 6.3369 4.5323 1.0699 2.0284 1.7479 6.8564 5.6620 5.9830 5.9307 5.7024 6.1918 4.1394 6.2339 5.7600 5.4316 7.5070 5.5161 6.6217 4.9001 8.9509 6.3272 12.2828 6.0068 4.9082 9.0598 9.0854 4.4010 2.6856 12.3505 6.7076 11.0352 4.4714 1.8027 2.2449 1.3618 1.3507 1.4229 2.7786 2.3971 1.5285 7.5719 2.5225 1.2035 1.1802 1.3006 1.0656 1.0513 1.1195 1.0853 9.7442 1.0293 1.0334 1.0584 1.1032 1.1054 1.1029 1.1054 1.1094
irintensity: 1.6280 3.5728 2.1571 6.6119 0.2290 3.9018 1.8063 5.3869 7.8584 7.3294 1.8926 2.5587 1.8645 6.0242 13.9434 3.9428 11.0258 39.2093 68.1452 41.1326 2.9900 2.9138 10.0024 0.1975 0.5148 20.9841 57.5918 4.8830 5.8613 35.0673 79.1524 26.4415 9.6180 2.6048 39.0968 21.0160 3.8080 2.4590 2.6103 3.7970 139.5666 62.9404 4.1163 9.9059 24.5576 22.6809 26.5574 25.7561 8.5282 16.4281 13.2338 231.1288 19.5707 15.3801 4.4955 4.4594 15.1692 1.2576 7.9073 7.9502
temp: 298.150 k
press: 1.00000 atm
elementType: 16 8 8 8 8 7 7 7 7 6 6 6 6 6 1 1 1 1 1 1 1 1
symmnumber: 1
zpe: 384565.7 jmol-1
zpe.correction: 0.146473 hartree
zpe.thermalcorrener: 0.162083 hartree
zpe.thermalcorrenthalpy: 0.163027 hartree
zpe.thermalcorrgfe: 0.101426 hartree
zpe.sumelectzpe: -1111.966191 hartree
zpe.sumelectthermal: -1111.950581 hartree
zpe.sumelectthermalent: -1111.949637 hartree
zpe.sumelectthermalfe: -1112.011238 hartree
dipole: -0.4194 -2.6721 2.6436
dipole: 3.7821
quadrupole: -94.9857 -95.1396 -91.1334
quadrupole: 7.9778 13.2180 -8.9702
quadrupole: -1.2328 -1.3867 2.6195 7.9778 13.2180 -8.9702
hfenergy: -1112.112664 hartree
pointgroup: C01 [X(C5H8N4O4S1)]
dipole: -0.4031168 -0.2081418 -1.4171531 debye
dipolederiv: 1.5766211 0.1028216 -0.0579417 0.0665938 1.4068913 -0.277494 -0.2443556 -0.1664115 1.3763926 -0.5727086 -0.0647793 0.0210993 0.0244095 -0.6308729 0.0141666 0.0590097 -0.1359323 -0.5786218 -0.6243534 0.0491342 -0.089744 0.0306183 -0.4978467 0.0551445 -0.0359769 0.1270422 -0.6254476 -0.5537072 -0.0824479 0.1009784 -0.0090788 -0.3200081 0.2816964 -0.1981005 0.3282965 -1.1674175 -0.9580253 -0.0841761 0.3120571 -0.1853943 -0.2877622 0.1226445 -0.1966326 0.1086913 -0.5021688 0.0023525 -0.0180934 -0.0137091 -0.0915367 -0.4922638 -0.0728273 -0.0246343 -0.1626172 -0.0376322 -0.2910326 -0.1189 0.1309811 -0.1143589 -0.3708864 0.0233061 0.1446919 0.0388179 -0.2859475 -0.1931714 0.064319 0.1105313 -0.0977458 0.1033799 0.1052503 0.1170933 -0.0226115 -0.1813057 -0.1356381 0.0489823 -0.0434565 0.1111082 -0.019641 -0.0765054 0.0303002 -0.026762 -0.1065416 -0.2564318 0.0438609 -0.0749605 0.0318866 -0.1117835 0.0074981 -0.1967398 0.0776684 -0.2022405 -0.0657216 -0.1175867 -0.0520816 0.0389719 0.0656349 0.0812675 0.0065632 0.2109337 -0.0445771 1.2519482 0.1927389 -0.4394398 0.2854567 0.2668873 -0.3810089 0.458445 -0.5053863 1.1961627 0.1345942 -0.0740494 0.0247088 -0.1696025 0.2213031 0.1248449 -0.0244499 0.0937987 0.1901004 0.2874396 -0.052255 0.1639563 -0.0450897 0.2548354 -0.0408342 0.1942277 -0.0690766 0.5510535 0.0189905 0.0120092 0.0137115 0.061028 0.0892538 0.0312344 -0.0268576 0.0315338 0.064048 0.1006321 0.0184358 -0.0386347 0.0018434 0.0796632 0.0017515 -0.0427531 0.0156678 0.1244419 0.0055471 0.0822751 -0.0401856 0.0620246 0.0419482 -0.035698 -0.0803316 0.0094023 0.05056 0.0740083 -0.058314 -0.0413205 -0.002435 0.0692557 -0.0312605 -0.0019478 0.0176012 0.1678119 0.1245583 0.0168851 0.0378678 -0.001422 0.0799004 0.0747821 0.0335761 -0.0044692 -0.0285154 0.0648335 -0.0170201 -0.0668764 -0.0473232 -0.0684543 -0.0510643 -0.0295759 0.0231316 0.0314089 0.037978 -0.0495282 0.0949959 -0.034033 0.0920179 0.0516103 0.0321532 0.0488194 -0.0177139 -0.0287134 0.105688 -0.0525373 0.0840788 0.0285478 -0.0085047 0.0262953 -0.0381382 0.0261495 unknown
polarizability: 129.34578|3.2532035|110.2380424|-12.9444207|-5.7238321|118.0953435 unknown
InChI: InChI=1S/C5H8N4O4S/c1-9-5(6-7-8-9)14(11,12)3-4(10)13-2/h3H2,1-2H3
charge 0 multiplicity 1
22 atoms
S  -0.037553 -1.02537 1.470217
O  -0.491248 -2.186054 0.415016
O  0.759252 -1.412363 2.831432
O  -2.013108 0.578664 -0.326451
O  -3.795238 -0.154688 0.998594
N  1.771672 -0.055779 -0.610458
N  1.066558 1.523562 0.807923
N  2.362693 1.155969 -1.021833
N  1.925121 2.101796 -0.155633
C  -1.561259 0.126443 1.961206
C  1.006001 0.21531 0.489194
C  -2.593258 0.15209 0.859389
C  2.052617 -1.31579 -1.315958
C  -2.908058 0.613219 -1.513889
H  -1.940338 -0.34109 2.88054
H  -1.072387 1.099847 2.131468
H  2.940828 -1.802777 -0.880753
H  1.179565 -1.979662 -1.214935
H  2.244557 -1.080407 -2.372453
H  -3.276886 -0.40279 -1.730307
H  -2.276523 0.992918 -2.327854
H  -3.75971 1.285555 -1.320956
