program: Gaussian 09
title: 000207931
version: EM64L-G09RevD.01
frameworkgroup: C1[X(C8H11F3O3)]
method: RPBEPBE
basis: SDD
operation: Freq
keyword: #p
keyword: freq=noraman
keyword: PBEPBE/SDD
title: #p freq=noraman PBEPBE/SDD
converged: NO NO NO NO
title: Mulliken charges:
elementType: F F F O O O C C C C C C C C H H H H H H H H H H H
charge: -0.140395 -0.140610 -0.140414 -0.213392 -0.217834 -0.217832 0.124231 -0.287289 -0.299309 -0.299575 0.183770 -0.436127 0.356188 -0.712267 0.220495 0.220551 0.228434 0.221262 0.221393 0.228502 0.210762 0.210742 0.222917 0.223089 0.232709
chargesum: 0.00000
title: Mulliken charges with hydrogens summed into heavy atoms:
elementType: F F F O O O C C C C C C C C
charge: -0.140395 -0.140610 -0.140414 -0.213392 -0.217834 -0.217832 0.124231 0.153757 0.150387 0.150320 0.183770 -0.014623 0.356188 -0.033553
polarizability: 1.07796496e+02 -9.88323359e-01 8.38078817e+01 5.70634542e-03 -1.81946381e-03 8.22057229e+01
1716.lowfreq: -118.4406 -9.9475 -0.0007 -0.0007 -0.0002 13.1776 18.3667 49.0227 64.1764
frequency: -118.4230 48.7098 64.0618 116.0180 128.8793 190.3944 209.5655 264.7313 267.2503 295.8011 300.1407 323.7307 371.2968 403.6298 444.1875 444.4351 503.0396 504.4131 548.8263 551.8335 564.2782 654.1900 708.2809 773.0889 815.9374 903.9960 904.4074 918.7498 921.1271 921.9410 934.5353 953.9313 961.7543 1009.7620 1049.5730 1053.2556 1054.3306 1057.8924 1063.3360 1138.4533 1147.0232 1156.4475 1167.9664 1235.2858 1257.4337 1323.5915 1325.9280 1326.3826 1327.9903 1348.1550 1372.8660 1408.2022 1467.7719 1471.1408 1473.2306 1483.8176 1489.6139 1495.1859 2972.6444 2990.2340 2995.0266 2999.0840 3004.6314 3022.1924 3057.5342 3067.6586 3070.7785 3086.0036 3086.4634
redmass: 2.9548 7.4555 2.4353 6.6367 4.7573 3.7010 1.7431 1.4763 5.6238 5.1911 8.1391 4.1392 2.6690 4.3477 5.0447 5.5681 8.6145 8.2142 7.7433 9.2823 3.9560 11.2673 9.0187 1.2100 4.5258 6.4163 6.9859 2.1798 2.4188 8.2044 3.0724 2.0582 2.2808 3.3017 8.1617 3.1310 9.2830 2.4416 2.4045 1.6905 1.2913 1.0652 2.4251 1.3969 1.9307 5.2557 1.6273 1.4093 1.2421 1.4827 1.4607 1.2037 1.0755 1.0803 1.0776 1.0610 1.0408 1.0957 1.0599 1.0373 1.0564 1.0575 1.0593 1.1011 1.1095 1.1092 1.1086 1.1002 1.0993
irintensity: 0.0057 0.0311 0.1868 0.0373 0.3985 2.8461 2.7906 1.4945 4.4203 8.9272 7.3123 0.5090 0.1011 0.4373 6.9921 7.1938 1.4812 1.2982 0.3637 0.8231 2.3537 17.1588 3.8230 6.2619 1.1516 130.9352 141.1930 15.6598 14.5908 16.3937 14.1613 19.8120 26.8241 35.5730 370.4816 110.9157 198.6894 110.4091 34.2102 5.1957 0.0161 0.0175 14.7866 0.0721 2.7601 6.5860 1.0369 2.6618 0.0594 0.5264 0.3793 16.2166 0.1995 8.3369 13.8627 6.4199 12.5439 5.5837 22.7239 10.8774 53.5799 40.5282 59.9638 13.2028 9.0328 29.0184 38.2903 40.5039 37.5382
temp: 298.150 k
press: 1.00000 atm
elementType: 9 9 9 8 8 8 6 6 6 6 6 6 6 6 1 1 1 1 1 1 1 1 1 1 1
symmnumber: 1
zpe: 490313.7 jmol-1
zpe.correction: 0.186751 hartree
zpe.thermalcorrener: 0.199265 hartree
zpe.thermalcorrenthalpy: 0.200210 hartree
zpe.thermalcorrgfe: 0.147966 hartree
zpe.sumelectzpe: -835.501618 hartree
zpe.sumelectthermal: -835.489103 hartree
zpe.sumelectthermalent: -835.488159 hartree
zpe.sumelectthermalfe: -835.540402 hartree
dipole: 7.9977 0.7139 -0.0001
dipole: 8.0295
quadrupole: -78.5418 -82.2273 -82.2384
quadrupole: 0.8936 -0.0015 0.0016
quadrupole: 2.4607 -1.2248 -1.2359 0.8936 -0.0015 0.0016
hfenergy: -835.6883683 hartree
pointgroup: C01 [X(C8H11F3O3)]
dipole: 3.150896 -0.2266341 0.0028058 debye
dipolederiv: -0.515831 -0.1003871 0.2123743 -0.058394 -0.3575647 0.174253 0.143145 0.1811652 -0.6116831 -0.4711463 0.2002697 -0.003615 0.1238189 -0.7457195 0.0088298 -0.0021835 0.0086938 -0.265877 -0.5162595 -0.1083496 -0.2087064 -0.0638612 -0.3709996 -0.183037 -0.141128 -0.1899637 -0.5979395 -0.7734982 0.2820284 -0.0052195 0.1251142 -0.8113779 0.0071632 -0.0023423 0.0069301 -0.4271463 -0.8230311 -0.1323204 0.2718675 -0.0471559 -0.4926783 0.118553 0.1301267 0.1322199 -0.6861498 -0.8234434 -0.1427514 -0.2664836 -0.0522747 -0.5024516 -0.1251684 -0.1283403 -0.13948 -0.6760035 -0.1934981 0.0038914 0.0000238 -0.0161117 -0.0816882 0.0004561 0.0002619 0.0007515 -0.035912 0.5499883 -0.2602127 0.0048997 -0.0850697 0.2938592 -0.0001423 0.0018598 -0.0002349 0.3020641 0.5749466 0.0867784 -0.192247 0.0227198 0.265804 0.0512359 -0.0529603 0.0350904 0.2614565 0.575261 0.0948477 0.1882098 0.0257428 0.2632423 -0.0504659 0.0514275 -0.0349385 0.2637602 0.768195 0.038679 -0.0006343 0.0395209 1.1241526 -0.0003689 -0.0003815 0.000392 1.1183108 0.1908643 -0.0195458 0.0003465 -0.0516021 0.0917046 0.0008719 0.0007101 0.0007599 0.1409147 1.540118 0.0044377 -0.0000107 -0.0080821 1.4551887 -0.0000415 0.0003163 0.0001476 1.4573529 -0.0596604 -0.0579034 0.0008907 -0.0165755 -0.0052133 0.0012752 0.0001752 0.0012772 0.0805914 -0.0122299 0.0738238 0.0371878 0.0415357 0.0058078 -0.0601154 0.0701198 -0.1306314 -0.0634057 -0.0122712 0.07228 -0.039904 0.0387755 0.0128472 0.0573569 -0.0717036 0.1278706 -0.0705337 -0.0148753 -0.0694609 0.0468729 -0.1060558 -0.1071133 0.0368744 0.0057243 -0.0112969 0.0691552 -0.015522 0.0086947 0.0726285 0.0527351 0.0233567 -0.1216902 0.066565 -0.055382 -0.0787979 -0.0156378 0.0058815 -0.0732838 0.0500343 0.030462 0.1167549 -0.0688398 0.0508967 -0.085234 -0.0147601 -0.0709751 -0.043814 -0.1063939 -0.1082282 -0.0297949 -0.0012029 0.0184937 0.0696859 0.0157559 -0.002636 0.0115991 0.0224054 -0.0249858 -0.1054962 0.0659073 -0.1298196 -0.062816 0.0157265 -0.0029584 -0.0115646 0.0204102 -0.0176085 0.1039531 -0.066658 0.1282928 -0.0703177 0.1069738 0.040284 -0.0679837 -0.0003618 -0.0057794 0.0879641 -0.0355682 0.1072939 -0.0719568 0.1069509 0.0424666 0.0668289 0.0008351 -0.0118406 -0.0897243 0.0357755 -0.109014 -0.0657638 -0.1831161 0.0131381 -0.000263 0.0482905 0.0768239 0.0005034 -0.0008058 0.0004858 0.1062452 unknown
polarizability: 107.7553443|1.4005036|83.848632|-0.0297407|-0.0256896|82.2061242 unknown
InChI: InChI=1S/C8H11F3O3/c1-2-6-3-12-8(13-4-6,14-5-6)7(9,10)11/h2-5H2,1H3
charge 0 multiplicity 1
25 atoms
F  -2.911759 -0.488967 1.14306
F  -2.746539 1.444664 -0.025338
F  -2.913029 -0.530748 -1.121581
O  -0.491504 -1.44802 0.025835
O  -0.314434 0.596408 -1.208901
O  -0.313922 0.63864 1.187373
C  1.691052 -0.2376 0.003846
C  0.992556 -1.625162 0.0299
C  1.179022 0.503859 -1.258922
C  1.179804 0.551405 1.237779
C  -0.80407 -0.033371 0.000829
C  3.228727 -0.423276 0.006679
C  -2.348458 0.098527 -0.000794
C  4.062767 0.878677 -0.013476
H  1.255063 -2.223334 -0.862483
H  1.254431 -2.189384 0.944328
H  1.561269 1.537973 -1.315402
H  1.445034 -0.042522 -2.182809
H  1.448851 0.042709 2.18207
H  1.559899 1.587772 1.252459
H  3.503921 -1.043997 -0.869994
H  3.503935 -1.015959 0.902603
H  3.865731 1.483682 -0.916681
H  3.864853 1.511164 0.870436
H  5.139899 0.63536 -0.009317
