program: Gaussian 09
title: 000207907
version: EM64L-G09RevD.01
frameworkgroup: C1[X(C17H15FN2O4S)]
method: RPBEPBE
basis: SDD
operation: Freq
keyword: #p
keyword: freq=noraman
keyword: PBEPBE/SDD
title: #p freq=noraman PBEPBE/SDD
converged: YES YES NO NO
title: Mulliken charges:
elementType: S F O O O O N N C C C C C C C C C C C C C C C C C H H H H H H H H H H H H H H H
charge: 0.951929 -0.183406 -0.201810 -0.181148 -0.505637 -0.537464 -0.321632 -0.708762 0.042595 -0.615937 0.144425 0.414338 -0.708084 0.148919 0.540967 -0.385033 -0.383780 -0.459586 -0.353745 -0.234714 -0.247970 -0.299855 0.461077 -0.218431 -0.236725 0.265882 0.284694 0.255614 0.224295 0.240547 0.285401 0.240189 0.312765 0.293430 0.230748 0.229684 0.298381 0.233743 0.346165 0.337932
chargesum: 0.00000
title: Mulliken charges with hydrogens summed into heavy atoms:
elementType: S F O O O O N N C C C C C C C C C C C C C C C C C
charge: 0.951929 -0.183406 -0.201810 -0.181148 -0.505637 -0.537464 -0.321632 -0.024664 0.042595 -0.065361 0.144425 0.414338 0.012372 0.148919 0.540967 -0.099632 -0.143591 -0.146821 -0.060314 -0.003966 -0.018286 -0.299855 0.461077 0.079950 -0.002982
polarizability: 3.38621596e+02 4.88304381e+00 2.32044060e+02 1.62877357e+01 -5.59975347e+00 1.45369583e+02
1716.lowfreq: -5.2383 -0.4348 -0.0016 -0.0009 -0.0004 2.4862 14.8907 24.6112 28.4406
frequency: 14.6662 24.5692 28.4279 43.0046 57.0980 67.2197 96.1290 106.2560 122.0059 142.7239 151.4309 167.3608 177.7792 202.7489 220.6629 237.1109 248.6157 258.1641 267.1961 273.1016 290.3605 310.3853 318.1634 333.9857 347.1882 377.4202 395.9381 403.9960 431.8883 452.8842 465.1833 474.0159 523.7710 533.3773 536.7094 557.6042 603.9062 616.0157 620.3054 638.2318 659.9593 678.2063 709.1033 719.7499 726.3758 766.1308 772.6998 787.4304 813.2694 832.7729 840.1430 858.9784 872.4984 884.1896 924.5232 930.9443 939.9277 955.5292 973.3056 985.1342 990.2028 1002.9392 1004.0574 1015.0535 1028.5399 1054.6262 1072.5772 1076.8237 1085.7230 1117.6934 1133.3734 1158.6164 1174.5679 1180.2808 1190.4636 1202.8617 1206.1356 1229.0159 1254.4341 1293.4428 1325.4035 1328.3009 1375.8677 1385.3159 1388.1888 1416.7985 1435.2165 1442.0243 1465.1244 1471.1791 1472.7957 1486.6407 1531.3090 1588.6369 1590.7319 1606.2217 1612.2477 1630.7946 1692.5972 2984.0369 3017.4113 3084.0311 3086.9523 3106.7630 3123.4938 3132.9519 3145.2085 3158.4804 3161.3723 3172.3325 3207.7653 3210.3326 3372.2142 3541.8137
redmass: 6.8088 5.2775 5.6712 7.1003 5.8371 5.2043 6.8745 4.4579 3.4362 2.9268 8.2631 4.5361 4.3153 4.7441 3.8082 3.7471 1.2007 3.3505 5.8540 4.9346 3.4506 5.3651 6.2755 6.5427 8.5515 3.4129 5.5289 2.9286 8.1855 3.3988 5.5103 4.3409 6.6717 5.4806 4.2006 3.6937 8.7591 6.0049 5.4579 5.3039 3.9666 6.4250 1.8729 4.1459 3.4036 5.3972 2.0106 1.7458 7.6209 4.1691 1.4784 1.2482 1.8524 2.2743 4.6349 1.3983 3.0380 1.7762 1.3498 1.3945 5.6063 3.8462 1.3977 4.4217 2.5165 2.4966 2.2813 1.5935 1.6711 3.2042 2.0768 1.5505 1.2313 1.6312 1.7190 1.9035 1.7167 2.1120 1.5475 2.0291 2.8874 1.6724 6.6752 1.1835 11.1992 3.9335 2.2424 1.0937 1.0622 2.7609 1.0899 2.0382 1.0896 6.0208 8.2672 6.9902 5.9073 11.7211 12.4069 1.0351 1.0629 1.0999 1.1000 1.1011 1.0855 1.0878 1.0935 1.0914 1.0969 1.0982 1.0929 1.0946 1.0412 1.1009
irintensity: 0.3134 0.8949 0.3047 0.5646 5.5367 0.6184 5.1711 6.6322 1.1722 10.0191 6.6210 4.2772 8.3491 1.8668 0.9310 6.4681 1.9428 2.6844 5.2688 5.1942 6.8433 8.7398 7.2130 6.5696 40.0292 7.3225 7.2256 0.0643 41.0830 26.0209 13.3573 127.8420 17.8775 19.0949 7.0695 7.1621 31.2061 4.4471 4.1441 19.0409 5.1149 5.7003 47.7648 10.4999 9.6353 23.3777 43.8904 177.4113 54.0037 52.3167 16.9818 0.1881 9.5909 30.8642 80.8171 6.8004 15.9347 1.8847 2.5254 0.3963 0.1827 2.3734 1.4737 29.3065 26.2091 7.0381 55.5367 48.5961 26.3879 96.0227 33.2456 16.8488 3.4137 4.7140 46.5985 62.1157 22.0304 5.1855 76.4292 11.5637 299.4016 105.9176 2.6777 19.9823 4.0068 60.8962 15.4953 12.6750 4.1205 118.8002 2.5599 36.9944 33.9800 2.0762 16.3607 94.1273 5.6393 397.1420 37.7433 19.1857 3.9516 32.0640 4.4505 8.1797 6.2652 3.9919 28.2181 8.2484 15.2493 18.3032 7.1593 0.8424 35.7501 29.4683
temp: 298.150 k
press: 1.00000 atm
elementType: 16 9 8 8 8 8 7 7 6 6 6 6 6 6 6 6 6 6 6 6 6 6 6 6 6 1 1 1 1 1 1 1 1 1 1 1 1 1 1 1
symmnumber: 1
zpe: 759571.6 jmol-1
zpe.correction: 0.289306 hartree
zpe.thermalcorrener: 0.312857 hartree
zpe.thermalcorrenthalpy: 0.313801 hartree
zpe.thermalcorrgfe: 0.234277 hartree
zpe.sumelectzpe: -1563.161600 hartree
zpe.sumelectthermal: -1563.138048 hartree
zpe.sumelectthermalent: -1563.137104 hartree
zpe.sumelectthermalfe: -1563.216628 hartree
dipole: -6.8256 -0.2654 2.8186
dipole: 7.3894
quadrupole: -150.9411 -151.8294 -158.7641
quadrupole: -12.6950 19.2847 1.8102
quadrupole: 2.9038 2.0154 -4.9192 -12.6950 19.2847 1.8102
hfenergy: -1563.4509053 hartree
pointgroup: C01 [X(C17H15F1N2O4S1)]
dipole: -2.6941158 -0.0849968 1.08924 debye
polarizability: 336.5007969|16.6829665|228.2113227|17.8715713|-20.9167497|151.3231196 unknown
InChI: InChI=1S/C17H15FN2O4S/c1-17(11-5-3-2-4-6-11)10-15(21)20(16(17)22)12-7-8-14(13(18)9-12)25(19,23)24/h2-9H,10,19H2,1H3
charge 0 multiplicity 1
40 atoms
S  5.750591 0.227042 -0.101689
F  3.586048 -1.989027 0.090174
O  -0.910705 -0.898214 1.263019
O  -0.455868 2.861741 -1.525378
O  6.199903 -0.752272 -1.314849
O  6.355385 1.730487 0.038851
N  -0.334366 0.902721 -0.167429
N  6.025611 -0.573681 1.522813
C  -2.686692 0.640228 0.372571
C  -2.507735 1.697886 -0.750157
C  -1.258224 0.069063 0.549036
C  -3.761681 -0.421413 0.058179
C  -3.046243 1.330317 1.733602
C  -1.013108 1.944925 -0.884546
C  1.093641 0.735647 -0.136945
C  -3.70208 -1.737439 0.586035
C  -4.9036 -0.046857 -0.698822
C  1.640032 -0.570625 -0.047239
C  1.943491 1.871044 -0.195277
C  -4.74555 -2.657488 0.338366
C  -5.949065 -0.965205 -0.939866
C  3.87823 0.409022 -0.090657
C  3.032135 -0.705761 -0.023658
C  3.342098 1.702613 -0.173462
C  -5.872789 -2.278754 -0.424761
H  -3.024816 2.650959 -0.552108
H  -2.86552 1.32233 -1.726299
H  -3.041831 0.588159 2.549273
H  -2.32636 2.1325 1.981655
H  -4.056692 1.768885 1.66483
H  -2.839253 -2.041954 1.184926
H  -4.992748 0.969091 -1.100885
H  1.009935 -1.458035 0.023648
H  1.518113 2.871541 -0.275303
H  -4.676104 -3.672039 0.746372
H  -6.819622 -0.653924 -1.52792
H  4.022152 2.559933 -0.210871
H  -6.680776 -2.994198 -0.612873
H  6.876628 -0.165617 1.943468
H  6.06803 -1.598131 1.397475
